program: Gaussian 09
title: 000292154
version: EM64L-G09RevD.01
frameworkgroup: C1[X(C21H25N3O3)]
method: RPBEPBE
basis: SDD
operation: Freq
keyword: #p
keyword: freq=noraman
keyword: PBEPBE/SDD
title: #p freq=noraman PBEPBE/SDD
converged: YES YES NO NO
title: Mulliken charges:
elementType: O O O N N N C C C C C C C C C C C C C C C C C C C C C H H H H H H H H H H H H H H H H H H H H H H H H H
charge: -0.226825 -0.183429 -0.261441 -0.226604 0.105507 -0.092536 -0.488597 0.281306 0.427289 0.471506 0.192451 -0.709526 -0.720688 0.125069 -0.063590 -0.422765 -0.430643 -0.434398 -0.311912 -0.362678 -0.356019 -0.256939 -0.238838 -0.263399 -0.247227 -0.627315 -0.620623 0.267602 0.234934 0.244126 0.240580 0.256253 0.238077 0.243557 0.254893 0.267015 0.248198 0.244171 0.242489 0.277478 0.204497 0.234721 0.235911 0.233979 0.232761 0.237032 0.191655 0.221109 0.254075 0.189450 0.223174 0.225126
chargesum: 0.00000
title: Mulliken charges with hydrogens summed into heavy atoms:
elementType: O O O N N N C C C C C C C C C C C C C C C C C C C C C
charge: -0.226825 -0.183429 -0.261441 -0.226604 0.105507 -0.092536 -0.220995 0.281306 0.427289 0.471506 0.192451 0.010115 0.017200 0.125069 -0.063590 -0.167872 0.084570 -0.190226 -0.069423 -0.085200 0.083199 -0.021029 -0.004859 -0.030638 -0.010195 0.039523 0.017128
polarizability: 2.91926959e+02 -5.20767786e+00 2.82439795e+02 1.83133061e+01 1.44961867e+01 1.99604112e+02
1716.lowfreq: -6.6603 -0.0005 0.0004 0.0006 3.1485 5.6688 25.8666 30.8432 32.8958
frequency: 25.7698 30.7812 32.8498 45.0242 52.5717 61.2479 78.1581 97.5207 103.4849 116.9162 132.0541 157.8158 169.1681 182.4694 215.7471 220.4547 230.7831 245.1736 252.2040 260.7103 276.2054 305.4358 309.5029 313.0148 323.1780 334.4892 342.6003 354.0583 375.4558 405.0352 411.6448 421.1919 434.4783 440.5834 478.8177 487.9550 505.1473 520.5628 543.9744 576.4401 600.2601 624.9356 643.4340 652.4181 677.3655 694.4711 702.5517 731.8281 749.4668 761.1513 764.3831 766.0452 786.4038 796.3957 831.1782 848.5554 860.5788 874.0267 891.7197 901.0159 936.1645 952.4083 961.2614 971.0276 986.6468 988.1628 998.2476 1011.7010 1023.4199 1037.2993 1045.7145 1049.8567 1053.9804 1071.4733 1088.0896 1093.1149 1117.5473 1129.6679 1136.9573 1150.1083 1173.2370 1175.8814 1178.0977 1179.1775 1194.4508 1200.9396 1219.0845 1227.8560 1239.7496 1254.2095 1272.1311 1276.1809 1286.4824 1306.7536 1331.3269 1338.5232 1351.2214 1367.8343 1377.3025 1380.7598 1382.2988 1394.5217 1400.5229 1412.4968 1424.2992 1434.2005 1437.6601 1440.9873 1451.3334 1458.6709 1460.5824 1464.9328 1466.7569 1474.2691 1478.1342 1480.0347 1481.2790 1486.2259 1489.9048 1491.8336 1526.8779 1587.9003 1589.2487 1606.9029 1608.8756 2853.7539 2871.0133 2909.5219 2999.1402 3011.8889 3015.4783 3015.8970 3021.7413 3027.4340 3037.9944 3074.2989 3096.5889 3096.7397 3102.4368 3106.6445 3111.1142 3122.7703 3128.5326 3130.7785 3140.2648 3140.9024 3156.3238 3162.4627 3172.0508 3176.1312
redmass: 5.7944 4.1422 2.9830 3.6758 9.7095 5.3303 4.8483 4.4539 4.3623 3.4037 4.6101 3.6962 5.9395 2.6567 1.2295 1.1961 1.5395 2.0999 3.1401 3.0369 3.8823 3.7678 1.1455 2.9735 4.5732 2.6611 4.0981 4.5213 3.2813 3.2085 2.9175 3.0730 3.4675 3.8189 4.7775 3.9006 4.0450 5.2502 4.1020 4.1997 4.1141 5.0327 6.1633 5.7862 5.7114 5.6080 4.6057 2.6180 2.3915 7.8551 1.6433 1.5694 2.0552 3.0038 3.3962 3.2378 2.3220 1.8969 1.6873 3.9458 1.5884 1.4182 1.5911 1.7484 1.4355 4.2484 1.3516 1.3090 2.6977 2.4926 1.7284 2.0486 2.4219 2.2642 1.5846 1.7908 1.8644 1.8498 1.5255 2.1780 1.7641 2.0495 1.1594 1.4651 1.8235 3.0918 3.2467 2.9511 1.8708 1.7787 2.2647 1.8926 1.7958 1.3789 1.4291 1.6316 2.2492 2.1168 1.4320 1.5015 3.8006 2.3458 2.0043 1.8765 1.1434 2.3078 1.1608 2.3452 1.1593 1.0545 1.0726 1.0727 1.0826 1.0834 1.2057 1.0902 1.7958 1.0637 1.1306 2.0142 6.2042 7.1263 6.8468 6.1859 6.1623 1.0567 1.0565 1.0677 1.0352 1.0379 1.0812 1.0729 1.0903 1.0763 1.0591 1.1008 1.1002 1.0997 1.0993 1.1054 1.1004 1.0876 1.1000 1.0870 1.0895 1.0897 1.0943 1.0947 1.0993 1.0980
irintensity: 0.9799 1.2498 0.3299 1.0728 0.5766 2.2167 0.9544 0.3780 0.1324 1.8207 2.0890 1.8926 1.6030 1.4073 0.7524 0.4222 0.1979 0.9682 3.3350 0.4258 1.8585 2.4884 1.1099 6.5800 0.5689 8.0976 1.6416 2.7295 1.8520 2.7726 6.2154 4.6307 6.0502 5.5883 3.7517 6.0066 8.2856 4.5969 1.0953 5.0569 14.6208 5.8824 4.3715 2.4831 2.4831 2.1073 35.2999 5.0133 30.2657 42.3203 48.3679 21.9194 19.9131 13.2576 3.9838 6.2983 3.6535 4.2483 0.5246 2.6797 3.2266 0.6070 2.0090 1.2644 0.8206 4.0508 0.5945 0.6440 21.2563 7.2987 44.8888 16.0457 16.6738 7.4124 1.4094 12.3662 12.1143 27.5170 12.5222 25.6732 5.8301 10.4015 3.6714 9.7734 9.1872 27.9221 47.3161 20.9360 8.3920 3.2966 11.5796 49.0106 28.8169 36.0114 11.2597 3.6657 3.4103 105.1196 47.9973 52.0256 5.3667 12.7643 68.5089 23.0437 6.7730 28.9347 5.1412 28.0279 36.1902 16.2327 2.7513 4.1701 37.9459 25.8858 40.5438 16.5761 7.4043 29.4337 4.2560 32.9666 192.7236 2.1762 22.7991 9.5004 3.7642 111.5699 146.2724 69.8808 10.9567 8.5833 2.7471 40.7029 31.6566 42.6124 17.3793 36.6488 4.4447 27.8681 29.5326 11.4911 6.9442 4.0105 11.2325 0.9294 8.6085 8.9858 15.0092 18.0339 20.0207 14.8227
temp: 298.150 k
press: 1.00000 atm
elementType: 8 8 8 7 7 7 6 6 6 6 6 6 6 6 6 6 6 6 6 6 6 6 6 6 6 6 6 1 1 1 1 1 1 1 1 1 1 1 1 1 1 1 1 1 1 1 1 1 1 1 1 1
symmnumber: 1
zpe: 1111184.6 jmol-1
zpe.correction: 0.423228 hartree
zpe.thermalcorrener: 0.448852 hartree
zpe.thermalcorrenthalpy: 0.449796 hartree
zpe.thermalcorrgfe: 0.367344 hartree
zpe.sumelectzpe: -1203.090668 hartree
zpe.sumelectthermal: -1203.065044 hartree
zpe.sumelectthermalent: -1203.064099 hartree
zpe.sumelectthermalfe: -1203.146552 hartree
dipole: 0.7667 2.0518 -2.5769
dipole: 3.3821
quadrupole: -153.5541 -161.3879 -158.5902
quadrupole: -16.2301 -0.8189 6.5175
quadrupole: 4.2900 -3.5439 -0.7461 -16.2301 -0.8189 6.5175
hfenergy: -1203.5138959 hartree
pointgroup: C01 [X(C21H25N3O3)]
dipole: -0.1008058 -0.8408158 -1.0263418 debye
polarizability: 294.7342368|-2.2335034|281.1567611|-10.8146083|-17.084266|198.0798673 unknown
InChI: InChI=1S/C21H25N3O3/c1-21(2,24(26)27)19-15-9-5-6-10-16(15)20(25)23(14-13-22(3)4)18-12-8-7-11-17(18)19/h5-12,19H,13-14H2,1-4H3
charge 0 multiplicity 1
52 atoms
O  3.480973 2.607922 1.058996
O  1.649929 3.11667 2.300227
O  -1.405398 -2.117455 0.835505
N  -1.17822 -0.032177 -0.14325
N  2.380637 2.289135 1.651529
N  -4.916246 -0.45292 0.450693
C  1.883084 0.484326 -0.005209
C  1.930595 0.76989 1.55913
C  0.866615 1.298442 -0.810662
C  1.836362 -0.99447 -0.383164
C  -0.527147 1.000537 -0.907524
C  3.078917 -0.033416 2.214233
C  0.628634 0.620798 2.352368
C  0.648609 -1.776176 -0.353198
C  -0.68703 -1.309805 0.152578
C  1.375409 2.385744 -1.569095
C  -2.53852 0.253781 0.415272
C  3.038033 -1.607539 -0.826517
C  -1.347815 1.804251 -1.746827
C  0.699243 -3.146328 -0.73002
C  -3.700054 -0.389419 -0.389046
C  0.554333 3.186985 -2.386152
C  3.077485 -2.959174 -1.222842
C  -0.82179 2.886141 -2.476092
C  1.896963 -3.73685 -1.172603
C  -4.93694 -1.635711 1.340124
C  -6.174889 -0.305278 -0.30418
H  2.875573 0.844162 -0.331692
H  3.200369 0.261765 3.271182
H  2.835936 -1.10828 2.18066
H  4.034637 0.132617 1.690205
H  -0.179979 1.245879 1.94653
H  0.790846 0.919735 3.401552
H  0.311951 -0.435187 2.343771
H  2.445174 2.61212 -1.494612
H  -2.563822 -0.157651 1.43788
H  -2.668618 1.345741 0.477092
H  3.954787 -1.007278 -0.861792
H  -2.410353 1.566231 -1.842132
H  -0.22128 -3.732664 -0.653731
H  -3.926167 0.219578 -1.284229
H  -3.379935 -1.39529 -0.74811
H  0.982343 4.026529 -2.942884
H  4.019053 -3.402239 -1.564927
H  -1.482387 3.481742 -3.115207
H  1.912721 -4.789741 -1.47306
H  -5.129051 -2.587194 0.783839
H  -5.726441 -1.51456 2.103742
H  -3.966095 -1.746564 1.850097
H  -6.377317 -1.150464 -1.010508
H  -6.158973 0.633588 -0.886145
H  -7.022437 -0.250373 0.403207
