program: Gaussian 09
title: 000292043
version: EM64L-G09RevD.01
frameworkgroup: C1[X(C12H9N3O)]
method: RPBEPBE
basis: SDD
operation: Freq
keyword: #p
keyword: freq=noraman
keyword: PBEPBE/SDD
title: #p freq=noraman PBEPBE/SDD
converged: YES YES NO NO
title: Mulliken charges:
elementType: O N N N C C C C C C C C C C C C H H H H H H H H H
charge: -0.190148 -0.276156 -0.000554 -0.000797 0.442866 -0.321265 -0.320908 0.223232 -0.200323 -0.200569 -0.207253 -0.219218 -0.793920 0.249329 -0.244984 -0.201381 0.249340 0.249165 0.234239 0.234222 0.275607 0.235272 0.283167 0.250560 0.250476
chargesum: 0.00000
title: Mulliken charges with hydrogens summed into heavy atoms:
elementType: O N N N C C C C C C C C C C C C
charge: -0.190148 -0.276156 -0.000554 -0.000797 0.442866 -0.071925 -0.071743 0.223232 0.033916 0.033653 0.068354 0.016054 -0.009716 0.249329 -0.244984 -0.201381
polarizability: 1.85936310e+02 2.73989347e+00 1.67181251e+02 -7.45057993e-02 -4.91313204e-02 1.03222686e+02
1716.lowfreq: -8.9904 -8.7421 -0.0009 -0.0004 0.0002 7.9428 15.2026 50.6602 61.2159
frequency: 14.5087 50.6255 61.2135 72.0323 94.4075 110.2074 139.6932 183.4765 194.0485 208.0643 255.7273 307.7266 329.1989 370.5120 404.0923 429.5941 448.8242 494.4295 496.8970 535.2097 590.4415 595.2034 620.3276 631.4702 635.2072 692.8383 731.3541 767.6136 795.1734 841.1654 901.4296 926.0340 935.3294 975.2886 990.3366 998.8294 1002.2744 1025.2849 1035.3258 1081.2467 1155.6897 1160.2100 1176.6071 1182.5397 1226.0205 1312.0010 1334.4111 1380.1463 1386.4124 1400.1096 1441.7410 1458.8568 1477.3210 1480.0149 1597.2691 1603.1420 1609.3702 1644.4596 2166.4001 2176.8065 2995.4102 3081.9721 3137.5290 3137.6712 3143.5744 3153.3529 3163.2113 3176.0285 3183.5054
redmass: 5.7463 5.4917 6.5695 4.9630 5.1075 7.3040 12.3943 2.5768 8.0687 1.4431 4.7147 3.9199 4.1362 7.6817 2.7941 7.8120 8.8067 4.0401 5.5447 4.4091 3.9719 12.0280 5.9677 4.9030 6.7001 1.9814 2.6492 3.1589 4.4184 1.2522 2.2576 1.3870 2.0676 1.3919 6.0162 1.6228 1.6489 2.0476 1.6648 1.5186 2.9410 4.5500 1.0536 1.1664 6.1592 1.3155 7.2783 1.2868 10.0601 1.3087 2.2212 1.0792 1.0456 2.3780 6.8460 6.6591 6.4504 8.5448 12.6209 12.6360 1.0388 1.0985 1.0853 1.0980 1.0887 1.0931 1.0976 1.1020 1.0895
irintensity: 0.2014 0.1723 1.6209 8.0192 2.0911 6.6954 2.6963 3.0378 1.6581 0.1917 1.4151 0.0081 1.5887 2.0473 0.0000 0.6742 1.7859 12.0345 0.4107 13.9152 2.8485 0.2838 0.3441 47.9790 3.9781 44.4884 21.0494 4.7195 6.6016 0.0111 0.7497 14.3102 5.8903 0.0386 5.7233 43.4877 37.3460 14.1295 4.8795 11.2657 4.6199 123.1103 0.0004 0.1168 495.6097 0.0055 15.4815 24.4213 2.7887 41.9853 7.8625 11.0346 22.0955 30.7886 440.6599 3.6525 83.6280 62.7209 19.3846 47.9565 2.4312 6.7926 0.4217 4.9339 0.6573 14.1450 19.0876 12.0245 6.0034
temp: 298.150 k
press: 1.00000 atm
elementType: 8 7 7 7 6 6 6 6 6 6 6 6 6 6 6 6 1 1 1 1 1 1 1 1 1
symmnumber: 1
zpe: 475602.0 jmol-1
zpe.correction: 0.181147 hartree
zpe.thermalcorrener: 0.196051 hartree
zpe.thermalcorrenthalpy: 0.196995 hartree
zpe.thermalcorrgfe: 0.137186 hartree
zpe.sumelectzpe: -701.000651 hartree
zpe.sumelectthermal: -700.985747 hartree
zpe.sumelectthermalent: -700.984803 hartree
zpe.sumelectthermalfe: -701.044613 hartree
dipole: 1.6291 4.0472 0.0057
dipole: 4.3628
quadrupole: -103.2081 -105.2914 -84.0456
quadrupole: -23.2699 -0.0319 -0.0744
quadrupole: -5.6931 -7.7764 13.4694 -23.2699 -0.0319 -0.0744
hfenergy: -701.1817982 hartree
pointgroup: C01 [X(C12H9N3O1)]
dipole: -0.7242126 1.4037581 -0.6717295 debye
dipolederiv: -0.9471546 0.5538391 -0.2738749 0.1685103 -0.8472445 0.2767217 -0.0933071 0.2850297 -0.3968272 -0.9872787 0.7087867 -0.3488387 0.5780356 -1.4001835 0.5926982 -0.2862947 0.5939616 -0.4397085 -0.4861771 0.114671 -0.0579329 0.0405954 -0.2180548 -0.0048596 -0.0240027 -0.003333 -0.2286007 -0.1801335 -0.0518767 0.0248881 0.0698047 -0.3341494 0.0605686 -0.0322402 0.0580477 -0.2362644 0.3667714 0.1298342 -0.0562943 0.3589039 0.0652039 0.0519956 -0.1640796 0.0469767 0.1336105 -0.1178929 -0.0170639 -0.0803496 0.0075792 -0.0965725 -0.0114897 0.0441452 0.0174071 0.0174107 -0.119139 0.0474454 0.0604296 -0.033181 -0.0307527 0.0712222 -0.0372392 0.0434309 -0.0460338 0.9841243 -0.3539888 0.1844852 -0.4255822 1.9802658 -0.8693263 0.2175243 -0.8671854 0.5457634 -0.0757212 0.0840062 0.0728253 0.0733504 0.0107561 0.121989 0.056535 0.0944934 -0.0037693 -0.0676742 -0.0029343 -0.1182654 0.0037382 -0.1041201 -0.0022916 -0.1002091 0.0252454 0.1027846 0.9167472 -0.9387404 0.4582484 -0.7734645 0.6693229 -0.3305389 0.3803941 -0.3333152 0.1619766 0.0601182 0.1317174 -0.0597712 0.1383446 -0.0145521 -0.00462 -0.0628368 -0.0049021 -0.0305318 -0.2386487 -0.2230663 0.0977365 -0.168878 -0.1906867 0.1067545 0.0724556 0.1056223 -0.0012373 -0.07878 0.1659391 -0.0805733 0.4890126 -0.3451638 0.1943318 -0.2309202 0.1868205 -0.043462 0.5616364 -0.2600013 0.1315105 -0.1866729 -0.0433295 0.0312785 0.097278 0.0299969 0.0187449 -0.0050469 0.1879357 -0.0892051 -0.0160204 0.248131 -0.0860318 0.0063858 -0.0817374 0.1043942 0.0750298 -0.0156906 0.0890407 -0.0048432 0.1091762 -0.0041784 0.08448 -0.0184849 -0.0142488 0.0812501 -0.0756657 -0.0420314 -0.0647102 0.0443332 -0.0735077 -0.0479722 -0.0592995 0.044416 0.0649506 -0.0650075 -0.0300202 -0.0881213 0.0480852 -0.0935522 -0.0391848 -0.0909823 0.012382 0.0591745 -0.0179448 0.074533 -0.0255935 0.1167526 -0.0332899 0.0980464 -0.0350622 -0.0506128 -0.0111465 -0.0520563 0.0210614 -0.0722355 0.1089215 0.015403 0.0303521 0.0164084 0.1375987 -0.0250493 -0.1039815 0.0461929 -0.1209987 0.069772 0.0077035 0.0541393 0.0081116 0.0897766 0.0764123 0.074885 -0.0358723 0.0097435 -0.0132365 0.0675172 -0.0057848 0.0686862 0.0999682 0.0441637 0.0176311 0.0650178 0.0565692 0.0396003 -0.0936389 0.0638483 -0.0650492 0.0581843 0.049464 -0.038673 -0.05294 -0.0138862 0.1277253 0.0091412 -0.0815128 -0.0208871 -0.0357141 unknown
polarizability: 186.1466594|-0.9398489|155.5901522|2.0864551|-24.3776542|114.6034349 unknown
InChI: InChI=1S/C12H9N3O/c1-10(16)15(9-11(7-13)8-14)12-5-3-2-4-6-12/h2-6,9H,1H3
charge 0 multiplicity 1
25 atoms
O  -1.231221 2.582121 -1.316463
N  0.135028 0.880409 -0.493556
N  4.351873 -1.291761 0.608135
N  0.246475 -2.784493 1.224321
C  -1.070047 0.115928 -0.162681
C  -1.615895 -0.761096 -1.122902
C  -1.668761 0.286132 1.102834
C  -0.064257 2.179774 -1.103608
C  -2.773637 -1.499282 -0.797851
C  -2.82651 -0.455841 1.419089
C  1.399332 0.382077 -0.23492
C  -3.376124 -1.350442 0.472364
C  1.170637 2.997012 -1.456718
C  1.76916 -0.829924 0.339147
C  3.179401 -1.083913 0.485389
C  0.894197 -1.867987 0.80803
H  -1.140826 -0.864873 -2.103933
H  -1.234177 0.983991 1.825978
H  -3.200266 -2.190981 -1.531348
H  -3.294155 -0.339678 2.402096
H  2.222469 1.039247 -0.525733
H  -4.27046 -1.930256 0.723887
H  0.820056 3.93949 -1.90051
H  1.814419 2.481382 -2.192102
H  1.781086 3.234161 -0.566646
