program: Gaussian 09
title: 000292052
version: EM64L-G09RevD.01
frameworkgroup: C1[X(C16H17NOS)]
method: RPBEPBE
basis: SDD
operation: Freq
keyword: #p
keyword: freq=noraman
keyword: PBEPBE/SDD
title: #p freq=noraman PBEPBE/SDD
converged: YES YES NO NO
title: Mulliken charges:
elementType: S O N C C C C C C C C C C C C C C C C H H H H H H H H H H H H H H H H H
charge: -0.012132 -0.263350 -0.175608 0.330442 0.372601 -0.488284 0.447864 -0.346861 -0.659658 -0.394134 -0.806955 -0.235853 -0.234901 -0.364891 -0.306688 -0.353255 -0.377127 0.331418 -0.537882 0.243787 0.230634 0.264064 0.250918 0.232019 0.269638 0.223351 0.212742 0.228342 0.266820 0.235582 0.227115 0.242154 0.252965 0.246732 0.225937 0.222457
chargesum: 0.00000
title: Mulliken charges with hydrogens summed into heavy atoms:
elementType: S O N C C C C C C C C C C C C C C C C
charge: -0.012132 -0.263350 -0.175608 0.330442 0.372601 -0.488284 0.447864 -0.103074 0.085958 -0.162115 -0.101224 -0.007511 -0.007786 -0.098071 -0.071107 -0.111101 -0.124162 0.331418 0.157243
polarizability: 3.23207650e+02 9.90428136e+00 1.68460853e+02 -1.84503963e+00 4.03760329e+00 1.43757925e+02
1716.lowfreq: -7.3282 -0.0014 -0.0006 0.0015 2.2822 9.8520 26.0370 41.5679 45.8298
frequency: 25.9237 41.5475 45.7756 70.3879 83.1018 112.4729 128.5269 134.0177 146.4300 166.5501 179.1558 192.9143 212.4442 248.5132 263.0488 272.0775 326.0318 346.2450 382.5925 416.6225 426.1646 458.6985 466.4570 486.4723 518.5727 527.3478 560.1478 574.0757 611.9304 629.4290 645.3610 717.9929 731.0567 738.7949 767.2311 779.7392 817.8772 820.1590 838.9748 868.5731 945.9034 951.0251 965.3934 972.9919 984.4781 986.1057 986.6173 1007.3578 1017.5028 1043.1100 1044.8137 1094.5988 1110.8238 1111.8521 1114.1185 1132.1263 1157.2261 1172.5688 1178.0781 1205.4457 1234.3343 1248.8745 1254.7423 1279.7962 1300.9806 1363.2248 1373.5806 1376.9270 1396.9390 1420.3572 1433.3126 1436.0976 1442.9340 1462.4678 1466.8691 1467.4034 1472.2299 1476.0726 1482.9697 1490.5592 1498.8170 1568.7229 1589.2069 1611.9779 1615.3361 2963.4565 2971.1685 2978.6365 3049.9768 3053.1122 3060.8868 3087.0416 3122.3250 3127.3748 3127.8612 3131.6237 3136.8613 3144.8785 3147.4071 3164.1929 3166.3669 3169.8062
redmass: 4.4676 4.0440 4.3773 4.9527 4.2170 4.1106 1.3186 1.5957 3.1980 1.8809 3.0786 2.8130 1.8975 2.5166 2.8768 3.6272 3.0892 3.4509 5.0777 3.0188 4.3603 3.5780 3.9886 4.0218 5.1397 3.1879 5.2539 4.0479 6.4720 5.4099 6.4360 3.4566 3.2194 3.2673 1.6242 4.6555 1.9212 1.9853 1.7021 1.3114 1.3796 1.4156 1.3563 4.7309 1.5841 1.3966 6.1584 3.0321 3.5810 2.0192 1.6063 1.8556 1.3139 1.2616 1.4237 1.5264 1.3280 1.0577 1.2315 2.4834 2.9255 3.8105 4.9283 1.5069 1.2851 5.2459 8.0326 3.1772 1.2448 3.9317 2.0565 1.1847 1.2712 1.0543 1.0536 1.0500 1.0770 1.3374 1.7139 1.4414 2.0135 7.0840 6.5945 6.5582 6.4114 1.0328 1.0381 1.0378 1.0965 1.1041 1.0986 1.0989 1.0861 1.0987 1.0997 1.0886 1.0884 1.0944 1.0880 1.1009 1.0953 1.0963
irintensity: 0.9426 0.5533 1.5132 2.8974 2.2386 3.7673 1.5778 0.3748 2.0791 1.5253 1.9399 1.4781 2.2691 1.9214 0.5368 4.8773 2.0539 3.3043 1.2310 1.7883 3.0802 1.6604 4.5835 8.9196 23.0906 6.9621 13.1507 5.7366 1.8992 5.6940 4.2817 4.1068 16.8583 10.9296 48.0670 3.5161 13.2628 4.2827 69.5623 0.7000 0.6475 4.8661 6.0530 45.4236 0.4802 1.4049 29.8085 7.6302 0.1664 13.4724 9.8787 112.8694 4.9420 0.2141 8.4419 29.6600 3.3253 1.2192 120.1257 0.8784 184.4712 29.5265 124.1519 10.9732 3.4261 3.8225 1.8367 198.9559 11.4445 3.2837 10.1397 11.5205 40.8917 16.4379 20.0773 13.2478 58.9815 16.2485 10.2551 109.5102 20.1391 17.3382 5.4481 31.2632 133.3638 76.2147 22.8180 48.6366 13.0745 44.6611 18.9848 27.3397 5.9768 16.8529 24.1375 5.7316 9.4440 30.8846 4.4246 29.5816 12.2063 5.8635
temp: 298.150 k
press: 1.00000 atm
elementType: 16 8 7 6 6 6 6 6 6 6 6 6 6 6 6 6 6 6 6 1 1 1 1 1 1 1 1 1 1 1 1 1 1 1 1 1
symmnumber: 1
zpe: 755616.9 jmol-1
zpe.correction: 0.287799 hartree
zpe.thermalcorrener: 0.306379 hartree
zpe.thermalcorrenthalpy: 0.307323 hartree
zpe.thermalcorrgfe: 0.240054 hartree
zpe.sumelectzpe: -1146.556079 hartree
zpe.sumelectthermal: -1146.537499 hartree
zpe.sumelectthermalent: -1146.536555 hartree
zpe.sumelectthermalfe: -1146.603824 hartree
dipole: -1.6749 -2.0016 2.7654
dipole: 3.8026
quadrupole: -92.3338 -120.0784 -118.3445
quadrupole: -11.4836 -0.1901 6.5516
quadrupole: 17.9184 -9.8261 -8.0923 -11.4836 -0.1901 6.5516
hfenergy: -1146.8438779 hartree
pointgroup: C01 [X(C16H17N1O1S1)]
dipole: 0.643089 0.0423447 1.3501052 debye
polarizability: 323.1563502|5.1932403|164.4154201|9.2972042|9.846702|147.8546577 unknown
InChI: InChI=1S/C16H17NOS/c1-12-6-4-5-7-15(12)17(2)16(19)13-8-10-14(18-3)11-9-13/h4-11H,1-3H3
charge 0 multiplicity 1
36 atoms
S  -0.694204 -0.96226 -1.947267
O  5.403422 0.473774 0.497412
N  -1.089355 -0.244031 0.650923
C  -2.521552 -0.193157 0.379675
C  -3.096831 0.977472 -0.189303
C  -0.185924 -0.487596 -0.370825
C  1.267604 -0.282707 -0.089488
C  -3.32513 -1.292814 0.755224
C  -0.727955 -0.170962 2.089364
C  -4.502259 0.997038 -0.371272
C  -2.240093 2.14971 -0.620578
C  -4.722274 -1.25188 0.564867
C  -5.31285 -0.099347 -0.000982
C  2.221244 -1.212798 -0.574808
C  1.746542 0.888436 0.569158
C  3.603957 -1.013018 -0.390515
C  3.122097 1.115001 0.73795
C  4.058366 0.15898 0.268078
C  6.41576 -0.466868 0.007273
H  -2.847352 -2.18912 1.166759
H  -0.858101 0.854575 2.483923
H  0.315177 -0.48349 2.237873
H  -1.390737 -0.843183 2.661861
H  -4.963796 1.888428 -0.812685
H  -1.624824 1.870199 -1.497333
H  -2.863706 3.01634 -0.897783
H  -1.541654 2.467582 0.175725
H  -5.339655 -2.112161 0.844885
H  1.859276 -2.093189 -1.115467
H  1.035817 1.646958 0.915747
H  -6.396704 -0.054874 -0.155071
H  4.308856 -1.758891 -0.769118
H  3.496446 2.023875 1.218427
H  7.38075 -0.018592 0.284917
H  6.358719 -0.580635 -1.092371
H  6.311123 -1.457592 0.490428
