program: Gaussian 09
title: 000292049
version: EM64L-G09RevD.01
frameworkgroup: C1[X(C13H16N4S)]
method: RPBEPBE
basis: SDD
operation: Freq
keyword: #p
keyword: freq=noraman
keyword: PBEPBE/SDD
title: #p freq=noraman PBEPBE/SDD
converged: YES YES NO NO
title: Mulliken charges:
elementType: S N N N N C C C C C C C C C C C C C H H H H H H H H H H H H H H H H
charge: 0.249885 -0.005200 -0.008280 -0.520670 -0.642673 0.164798 0.128126 -0.596443 0.117078 -0.798132 0.475160 -0.428064 -0.789632 -0.375118 -0.382820 -0.222140 -0.222392 -0.237707 0.249553 0.205017 0.280936 0.287747 0.223925 0.260185 0.235684 0.237848 0.236285 0.269242 0.266794 0.326827 0.334987 0.225580 0.225650 0.227965
chargesum: 0.00000
title: Mulliken charges with hydrogens summed into heavy atoms:
elementType: S N N N N C C C C C C C C C C C C C
charge: 0.249885 -0.005200 -0.008280 0.015366 0.019140 0.164798 0.128126 -0.141873 0.117078 -0.229449 0.475160 -0.428064 -0.069838 -0.137270 -0.146535 0.003440 0.003258 -0.009742
polarizability: 3.15477872e+02 -1.44329505e-01 1.52452305e+02 1.39972591e+00 4.70361630e-01 1.33281755e+02
1716.lowfreq: -14.2055 -0.0024 -0.0020 -0.0004 2.0782 4.4957 7.6914 21.6312 43.4858
frequency: -11.2591 21.5703 43.4524 50.4849 62.5237 79.0101 112.1933 126.4432 162.1220 184.2579 201.6432 211.7520 222.7728 265.2830 306.7724 322.4990 340.9874 371.5963 402.8815 428.9179 454.0043 477.3081 515.6677 533.9334 542.4395 548.0441 564.8130 590.8658 616.5311 647.5791 657.8420 662.0194 701.7609 731.4949 777.0128 795.1952 808.6347 849.2177 851.8154 883.7942 887.4108 925.0421 957.9992 976.3037 989.7697 994.5784 1004.9425 1026.1314 1038.3567 1044.9347 1057.3126 1072.4047 1121.5986 1139.2058 1170.9596 1172.0949 1187.3170 1217.5159 1243.0708 1273.6203 1285.1508 1319.2427 1324.4073 1338.3618 1345.3767 1383.7921 1390.9646 1432.0446 1438.8629 1446.1320 1452.2075 1473.5261 1480.1700 1483.3708 1522.9589 1541.6092 1593.0992 1613.4269 1617.4194 1651.9588 2974.2816 2983.2516 3051.5961 3060.1003 3075.0479 3118.7477 3120.6973 3123.2715 3127.0172 3136.0726 3147.2999 3163.8387 3433.6006 3543.2544 3556.6165 3696.1946
redmass: 4.7116 3.7112 5.4022 4.0669 3.4582 5.5811 5.4221 1.0626 3.5278 5.8297 2.8482 2.8202 2.0493 5.0836 2.7535 2.2465 1.9894 7.3077 2.8018 1.1762 3.3888 3.9405 3.3250 4.4419 2.8318 1.7859 6.1654 2.8798 6.3330 1.9494 4.6944 6.5003 1.6260 3.9330 2.2037 5.9199 3.9527 1.6098 1.2500 4.6238 1.6294 1.4670 2.0818 1.3911 5.6790 1.3453 2.4040 2.1973 1.7111 1.6795 3.0086 1.4846 1.0869 2.7621 1.9645 1.0519 1.1144 1.9560 1.6235 6.2015 4.8571 1.2316 1.2790 1.3751 4.8453 8.7748 1.2627 3.8956 2.1596 1.1220 1.1498 1.0876 1.1443 2.3413 4.9597 5.3239 6.1077 5.9324 1.3121 1.0830 1.0703 1.0389 1.0581 1.0972 1.0922 1.0976 1.0850 1.0908 1.1050 1.0921 1.0965 1.1017 1.0453 1.0452 1.0963 1.1038
irintensity: 0.1846 0.0852 0.8383 0.0781 2.3729 1.0995 0.3757 1.1428 1.8702 4.9206 10.3755 17.5363 23.8678 6.6995 4.0956 0.8597 5.0780 3.4131 0.0171 144.0961 41.6368 9.7950 6.0193 15.4437 37.6207 30.4452 31.1729 27.9919 0.1549 229.7408 18.2553 35.4594 60.6843 126.4921 27.8720 28.2379 8.9489 0.9554 0.0167 32.7806 2.6351 3.9015 26.9834 0.0147 0.6516 0.3427 92.0058 7.8631 0.7756 17.8104 12.7230 9.7778 1.6899 31.4392 78.1854 0.0364 1.1218 1.2558 54.5729 207.9974 52.8500 0.2336 0.2640 11.6536 91.6415 0.1207 23.4288 152.7836 7.5054 3.7202 50.3446 33.2226 11.0803 13.6596 223.5814 307.7389 0.9791 10.3740 326.8132 31.8106 60.4914 17.9956 7.6760 16.9642 18.8157 9.4937 5.7655 0.1667 3.9961 18.1359 43.6492 27.0491 2.8470 80.0548 0.3716 34.1367
temp: 298.150 k
press: 1.00000 atm
elementType: 16 7 7 7 7 6 6 6 6 6 6 6 6 6 6 6 6 6 1 1 1 1 1 1 1 1 1 1 1 1 1 1 1 1
symmnumber: 1
zpe: 712212.8 jmol-1
zpe.correction: 0.271268 hartree
zpe.thermalcorrener: 0.288621 hartree
zpe.thermalcorrenthalpy: 0.289565 hartree
zpe.thermalcorrgfe: 0.224664 hartree
zpe.sumelectzpe: -1120.741534 hartree
zpe.sumelectthermal: -1120.724181 hartree
zpe.sumelectthermalent: -1120.723236 hartree
zpe.sumelectthermalfe: -1120.788138 hartree
dipole: -2.4468 0.8096 -0.1029
dipole: 2.5793
quadrupole: -97.7190 -111.1779 -107.7501
quadrupole: 6.7612 1.7617 1.4340
quadrupole: 7.8300 -5.6289 -2.2011 6.7612 1.7617 1.4340
hfenergy: -1121.0128016 hartree
pointgroup: C01 [X(C13H16N4S1)]
dipole: 0.9600876 0.3278621 -0.0219148 debye
polarizability: 315.471125|1.5067669|151.839608|-0.7930743|-3.4492688|133.9011984 unknown
InChI: InChI=1S/C13H16N4S/c1-9-11(7-14)12(15)17-13(16-9)18-8-10-5-3-2-4-6-10/h2-6H,7-8,14-15H2,1H3
charge 0 multiplicity 1
34 atoms
S  -0.849387 -1.140847 0.004384
N  1.130243 0.770477 -0.081363
N  1.794104 -1.551848 0.208096
N  5.661774 0.27405 -1.273586
N  4.025771 -2.18526 0.390113
C  3.506919 0.209897 0.083847
C  2.456049 1.149179 -0.057668
C  4.985617 0.582278 0.017216
C  3.106394 -1.163844 0.232308
C  -1.767096 0.529098 -0.219731
C  -3.255513 0.284579 -0.163133
C  0.87833 -0.560662 0.043914
C  2.710069 2.636813 -0.20171
C  -3.940925 0.289307 1.079858
C  -3.996279 0.045054 -1.349595
C  -5.334331 0.065932 1.135853
C  -5.390367 -0.178859 -1.297027
C  -6.063864 -0.168641 -0.053411
H  5.114957 1.660065 0.207929
H  5.54997 0.073211 0.82479
H  -1.43611 0.940797 -1.184921
H  -1.405366 1.185472 0.585534
H  3.361269 2.861823 -1.066857
H  1.746617 3.148936 -0.344383
H  3.200559 3.055891 0.69668
H  -3.376359 0.466405 2.003163
H  -3.475681 0.033625 -2.314844
H  5.353797 0.885827 -2.037954
H  5.575216 -0.711642 -1.550259
H  5.009488 -2.003234 0.566505
H  3.657623 -3.126767 0.515764
H  -5.850373 0.07505 2.102556
H  -5.949291 -0.360024 -2.222044
H  -7.145226 -0.341236 -0.011224
