program: Gaussian 09
title: 000292017
version: EM64L-G09RevD.01
frameworkgroup: C1[X(C7H9ClN2)]
method: RPBEPBE
basis: SDD
operation: Freq
keyword: #p
keyword: freq=noraman
keyword: PBEPBE/SDD
title: #p freq=noraman PBEPBE/SDD
converged: YES YES NO NO
title: Mulliken charges:
elementType: Cl N N C C C C C C C H H H H H H H H H
charge: -0.077803 -0.429839 -0.536392 0.520383 0.503369 -0.232758 -0.383336 -0.431322 -0.437263 -0.797662 0.228047 0.247031 0.229268 0.241458 0.241461 0.218367 0.309305 0.293879 0.293808
chargesum: 0.00000
title: Mulliken charges with hydrogens summed into heavy atoms:
elementType: Cl N N C C C C C C C
charge: -0.077803 -0.120534 0.051294 0.520383 0.503369 -0.232758 -0.155288 -0.184291 -0.207995 -0.096376
polarizability: 1.48517911e+02 -8.78298516e-01 1.04872312e+02 2.13597826e-02 -6.98215643e-03 4.90639384e+01
1716.lowfreq: -8.4484 -0.0015 -0.0009 0.0011 4.6710 7.2765 58.2999 117.1068 131.7275
frequency: 58.2757 117.0933 131.7271 177.1656 181.3753 231.8623 251.2857 318.2331 318.5312 402.2163 435.6884 439.4818 538.8499 544.4022 593.5998 603.5696 685.4739 698.2603 752.6839 812.3942 845.1913 866.3330 938.5766 993.5230 1013.3640 1045.6992 1144.4976 1171.4082 1220.3586 1249.8371 1268.3405 1324.3360 1340.7188 1401.4312 1411.7893 1452.0277 1461.5423 1482.1391 1499.7241 1572.7160 1629.2790 1669.3726 2980.3366 3058.3229 3088.4268 3124.8636 3146.2813 3157.5934 3408.2510 3531.8340 3566.0619
redmass: 4.0262 1.3287 1.9030 5.3921 5.2917 3.8678 1.1166 3.9870 5.1316 6.2494 2.8658 4.0676 1.3462 1.4062 2.3158 4.7188 7.4654 2.5831 4.6649 1.3369 1.6492 5.6989 1.3295 1.4625 2.8196 1.4819 1.4425 2.7097 2.3129 1.1692 1.5176 2.8753 3.5773 1.2921 3.6302 1.4473 1.0450 1.1859 3.5297 4.5662 6.0682 1.1014 1.0366 1.0976 1.0994 1.0883 1.0918 1.0943 1.0401 1.1039 1.0782
irintensity: 5.6474 0.1112 0.0790 0.4807 1.4077 0.9760 1.4576 14.3916 11.1338 2.4434 0.1874 2.6671 119.6271 228.3934 65.3851 67.3174 17.2324 11.8315 2.2863 17.4319 38.3306 30.0033 0.0002 10.9267 49.3981 7.1208 0.4151 8.4194 5.3988 0.3512 2.9563 29.6546 32.8490 11.1306 5.0014 5.5353 13.2572 31.8749 174.4333 24.8893 165.3711 15.4869 36.1550 18.6730 18.5892 15.4079 4.0748 14.3012 7.5147 0.1474 48.4582
temp: 298.150 k
press: 1.00000 atm
elementType: 17 7 7 6 6 6 6 6 6 6 1 1 1 1 1 1 1 1 1
symmnumber: 1
zpe: 390917.8 jmol-1
zpe.correction: 0.148893 hartree
zpe.thermalcorrener: 0.159294 hartree
zpe.thermalcorrenthalpy: 0.160238 hartree
zpe.thermalcorrgfe: 0.112824 hartree
zpe.sumelectzpe: -840.935750 hartree
zpe.sumelectthermal: -840.925349 hartree
zpe.sumelectthermalent: -840.924405 hartree
zpe.sumelectthermalfe: -840.971818 hartree
dipole: -2.3833 1.5224 0.0007
dipole: 2.8281
quadrupole: -63.4580 -60.0795 -68.5668
quadrupole: 0.0371 0.0176 -0.0068
quadrupole: 0.5768 3.9552 -4.5320 0.0371 0.0176 -0.0068
hfenergy: -841.0846426 hartree
pointgroup: C01 [X(C7H9Cl1N2)]
dipole: -0.8848896 0.6739198 0.0279405 debye
dipolederiv: -0.5626929 0.3102945 0.0106607 0.3727451 -0.4330551 -0.0168497 0.0161314 -0.0188138 -0.0904814 -0.9757025 -0.2582359 -0.0376054 -0.5774343 -0.0486052 0.0165442 -0.063728 0.0274793 -0.4931389 -0.4214509 -0.2699513 -0.0366492 -0.6065144 -0.2801337 -0.04503 -0.0646903 -0.0342662 0.0231008 -0.0825361 0.282975 0.0229071 0.2042576 -0.3936593 -0.0233273 0.0181722 -0.0200315 -0.0383348 1.2552935 0.4329611 0.0727853 0.6004349 0.1411048 0.0206839 0.0858223 0.0147424 0.1413095 0.8307748 -0.3130762 0.0029974 -0.5245135 0.7789995 0.0541985 -0.0152934 0.0611146 -0.0606924 0.2819698 -0.2254421 -0.0049162 0.0826371 0.1315204 0.0261918 0.021011 0.0158093 -0.1438951 -0.6477403 -0.1454684 -0.0273466 0.2410339 -0.0985352 0.0154097 0.0047364 0.002388 -0.1856618 -0.3123802 0.0353162 0.0013194 -0.4635319 -0.1048802 -0.0024227 -0.0400284 0.0143257 -0.2593139 -0.0940743 -0.0335095 -0.0085381 0.0128441 0.1212703 0.0039292 -0.0063262 0.0014859 0.0777287 0.0630804 -0.041041 -0.0062032 -0.0331517 -0.1182151 -0.0235282 -0.0057009 -0.0236486 0.1457529 0.0743557 -0.0485881 -0.0074343 -0.0395055 -0.0514282 -0.0205647 -0.0065058 -0.0208874 0.1740012 -0.0372097 0.1055464 0.001839 0.0925743 0.0220603 -0.0098184 0.0008935 -0.0093385 0.1745972 -0.0298174 -0.0189456 -0.0770784 0.0180259 0.0641066 0.0863219 -0.1211521 0.0373628 -0.0384451 -0.0427532 -0.0281696 0.0733554 0.0052592 0.0810823 -0.0681234 0.1228635 -0.021206 -0.0401711 0.0804603 0.0604791 0.0037566 -0.0570113 -0.1591862 -0.0227797 -0.0054 -0.0189297 0.1061756 0.0961875 0.0795667 -0.0017728 0.1309306 0.1034708 -0.0154037 0.0032475 -0.0167774 0.34417 0.2583934 0.0289846 0.0848853 0.2638848 0.1060123 0.1333503 0.060294 0.080217 0.1013688 0.2658422 0.0463039 -0.0669621 0.2770351 0.1380707 -0.1087816 -0.0043465 -0.071026 0.06193 unknown
polarizability: 147.9711342|-4.6939657|104.9365933|2.9039538|4.563921|49.5464337 unknown
InChI: InChI=1S/C7H9ClN2/c1-5-2-3-6(10-9)4-7(5)8/h2-4,10H,9H2,1H3
charge 0 multiplicity 1
19 atoms
Cl 2.564685 -1.887142 -0.13564
N  -2.54371 -0.876275 -0.217414
N  -3.718227 -0.11121 -0.193718
C  1.450276 0.684229 0.04546
C  -1.245977 -0.347221 -0.130764
C  1.166253 -0.698256 -0.080885
C  0.314407 1.533508 0.0791
C  -0.127835 -1.230223 -0.168497
C  -1.007898 1.049622 -0.005542
C  2.860202 1.230323 0.139689
H  0.47935 2.61351 0.175419
H  -0.274269 -2.311314 -0.264864
H  -1.849249 1.748837 0.025303
H  3.394961 0.823223 1.017861
H  3.460218 0.960709 -0.749117
H  2.845754 2.330243 0.224761
H  -2.676487 -1.88279 -0.303609
H  -3.843244 0.494278 -1.013327
H  -3.89951 0.35505 0.702786
