program: Gaussian 09
title: 000292024
version: EM64L-G09RevD.01
frameworkgroup: C1[X(C11H12ClNO)]
method: RPBEPBE
basis: SDD
operation: Freq
keyword: #p
keyword: freq=noraman
keyword: PBEPBE/SDD
title: #p freq=noraman PBEPBE/SDD
converged: YES YES NO NO
title: Mulliken charges:
elementType: Cl O N C C C C C C C C C C C H H H H H H H H H H H H
charge: -0.053697 -0.217351 -0.194640 -0.085076 -0.507333 0.442181 0.194805 0.071007 -0.740245 -0.659107 -0.300846 -0.374507 -0.235504 -0.247353 0.245180 0.245497 0.238163 0.221036 0.237393 0.228024 0.253308 0.216633 0.245792 0.280882 0.256177 0.239581
chargesum: 0.00000
title: Mulliken charges with hydrogens summed into heavy atoms:
elementType: Cl O N C C C C C C C C C C C
charge: -0.053697 -0.217351 -0.194640 0.160104 -0.023673 0.442181 0.194805 0.071007 -0.053792 0.056626 -0.300846 -0.093625 0.020673 -0.007771
polarizability: 1.70773203e+02 -2.35659770e+00 1.69568380e+02 2.36975193e+00 -1.87955931e+00 7.44247489e+01
1716.lowfreq: -9.2602 -5.5579 -0.0024 -0.0022 -0.0017 11.6178 61.5626 79.1193 119.2822
frequency: 61.5398 79.0685 119.2621 129.6389 162.4248 189.6895 217.8637 251.7566 273.6448 300.2059 306.7925 344.2655 360.6161 406.5771 429.4819 462.7609 477.1408 538.7569 549.7848 569.6485 614.8992 654.8494 724.2683 735.1900 787.1194 797.0005 865.0790 896.7021 927.7269 933.1495 986.6727 1008.8545 1041.8060 1069.5388 1091.1160 1093.5556 1107.9437 1137.7082 1149.2556 1173.4667 1184.4331 1224.5742 1270.7694 1276.3378 1308.6268 1342.7674 1353.6639 1379.9761 1391.6854 1419.5471 1426.3777 1443.5107 1460.7388 1466.7106 1477.2057 1483.4922 1497.4835 1541.2553 1577.0722 1614.6926 2938.6470 2964.2554 2982.0978 2988.4999 3060.0930 3068.0003 3086.0249 3090.5937 3132.1932 3145.6744 3157.6393 3174.7697
redmass: 7.2781 2.9637 2.0137 2.6675 2.8010 4.2604 2.4639 1.0567 3.1129 4.4038 4.8315 4.4901 4.2936 4.9526 3.7750 5.0053 4.6455 3.6723 3.2695 3.4238 3.9269 5.3850 4.8849 3.4452 2.0984 2.7416 3.0548 1.6179 1.5105 1.7424 1.3482 2.4918 4.2571 2.0193 1.9279 2.0188 1.5240 1.8085 1.6721 1.8355 1.3797 2.3827 1.3943 2.9691 2.1763 1.3045 3.0405 2.3439 1.2699 1.6125 1.2677 1.9907 1.4809 1.0533 1.1274 1.1061 1.1423 6.6231 9.2740 8.2731 1.0515 1.0809 1.0676 1.0370 1.0846 1.0956 1.0992 1.1000 1.0972 1.0865 1.0922 1.0997
irintensity: 4.7292 3.7929 6.2011 1.0020 5.4360 1.6509 3.0258 0.0480 1.5983 1.5398 2.0450 3.1879 1.5408 3.9163 3.2525 5.2572 3.2458 7.8452 1.9030 3.5323 9.4323 17.4745 9.9956 26.3718 28.0132 36.2142 15.2817 4.8070 5.2076 11.3898 2.5521 2.8076 15.3085 50.5128 19.9020 24.4548 16.3491 42.4779 2.8069 11.1787 10.1501 9.2077 8.5157 180.0002 5.5624 7.4414 20.3542 5.3079 42.6338 72.6961 13.6338 34.5814 77.7037 1.9824 29.3393 29.1990 21.6949 5.8299 220.0112 84.0015 86.7583 7.4841 18.5222 26.1790 26.9052 9.8162 36.0361 23.2309 7.2597 1.2296 1.3837 14.4455
temp: 298.150 k
press: 1.00000 atm
elementType: 17 8 7 6 6 6 6 6 6 6 6 6 6 6 1 1 1 1 1 1 1 1 1 1 1 1
symmnumber: 1
zpe: 538057.7 jmol-1
zpe.correction: 0.204935 hartree
zpe.thermalcorrener: 0.217887 hartree
zpe.thermalcorrenthalpy: 0.218831 hartree
zpe.thermalcorrgfe: 0.165776 hartree
zpe.sumelectzpe: -1015.374887 hartree
zpe.sumelectthermal: -1015.361936 hartree
zpe.sumelectthermalent: -1015.360991 hartree
zpe.sumelectthermalfe: -1015.414046 hartree
dipole: 0.0543 -2.6486 0.3850
dipole: 2.6770
quadrupole: -87.6170 -92.5447 -89.7230
quadrupole: -15.8927 -1.5006 -2.8347
quadrupole: 2.3446 -2.5831 0.2385 -15.8927 -1.5006 -2.8347
hfenergy: -1015.5798221 hartree
pointgroup: C01 [X(C11H12Cl1N1O1)]
dipole: -0.412758 0.9578744 0.1461156 debye
dipolederiv: -0.1538115 -0.0968625 0.0169013 -0.1649044 -0.7476996 0.0514603 0.0395606 0.0550127 -0.0767054 -0.6017961 -0.1600667 0.0158077 -0.2780428 -1.1529865 0.0635094 0.0469042 0.0825733 -0.3268988 -0.9246721 0.4098475 0.0223719 0.5305205 -0.8250248 -0.0478174 -0.1308512 0.0862301 -0.3640025 0.5553857 -0.044 0.1321425 0.2255466 0.1677732 -0.0319037 0.2258102 -0.0413592 0.3080461 -0.3582156 0.1803854 0.0005143 0.1316458 -0.1187311 0.0209017 0.0500186 0.0408116 0.0612764 0.9391518 -0.625706 -0.0899942 -0.5139475 0.2542055 -0.0553798 -0.0922172 -0.0378432 0.0471363 -0.7534122 -0.6018624 0.0689182 0.1211755 -0.3665187 0.011769 0.1795727 -0.0584499 -0.0674317 1.2840277 0.5170038 -0.1132502 0.2929074 1.1949921 -0.0477099 -0.158046 -0.0980586 0.1256154 -0.1036827 0.0733848 -0.0337637 0.0524617 0.0192938 0.0181223 -0.0548385 0.0375049 0.0875044 0.0061848 -0.0597329 -0.1203504 -0.3237768 0.5322963 0.1273126 -0.1074334 0.0444534 0.3362499 -0.3337914 0.4582554 0.0200318 0.2354792 1.0630609 -0.089444 -0.0983898 0.0034225 -0.1012837 0.2280648 0.3039631 -0.014179 -0.1437629 0.0219741 0.0178557 0.0123695 -0.0130013 -0.0937484 0.0827367 -0.133888 -0.0111953 -0.0596391 0.0919283 0.0171876 -0.0051888 0.0168763 -0.0746605 -0.0785943 -0.2038382 -0.0050651 -0.1077042 -0.2876017 0.0098879 0.0085733 0.0247225 -0.1944292 0.0028703 0.0232034 0.063032 -0.0501902 0.0036409 -0.0674901 0.0085113 -0.0336121 -0.1219483 -0.045137 -0.0601947 -0.0480023 -0.1018242 0.0533849 -0.029806 -0.081178 -0.0367159 0.0768027 0.0913007 0.004823 0.0168567 0.0577228 0.0402983 -0.0487152 0.0299256 0.0041334 -0.0831405 0.0759637 0.0207422 0.0327513 0.0480386 0.056215 -0.0168666 0.0914205 -0.0611226 -0.116648 0.0883041 -0.0496961 0.0373753 0.0311928 -0.0906891 0.1021319 0.0248269 0.0841537 0.0433664 -0.05353 -0.0411853 -0.0737992 -0.1169576 0.0311555 -0.0768688 -0.0850099 -0.0492184 0.0530396 -0.000038 -0.0771339 -0.0988307 -0.014702 0.0782803 -0.033035 -0.065658 -0.0055626 0.0888813 -0.0189803 0.0420142 0.1550332 -0.018491 -0.0286633 0.0845308 0.1970603 -0.0819836 -0.1173317 0.0235039 0.1400523 0.0081721 0.1295036 -0.0741405 0.025054 -0.0320935 0.071068 0.0313076 0.1236024 -0.0350833 0.0001639 0.0320917 -0.0048848 -0.0053541 -0.0247552 -0.0075748 0.1546429 -0.0125096 -0.0610623 0.0070266 -0.0770826 0.0728622 0.0050621 0.0143442 -0.0134149 0.1556536 -0.0629258 0.0766374 0.0113311 0.082739 0.0155788 -0.0043949 0.0067616 -0.0130453 0.168706 unknown
polarizability: 172.1813587|-1.2891662|168.0970316|-3.9079619|-0.088692|74.487942 unknown
InChI: InChI=1S/C11H12ClNO/c1-7-6-10(14)8-4-3-5-9(12)11(8)13(7)2/h3-5,7H,6H2,1-2H3
charge 0 multiplicity 1
26 atoms
Cl 1.902399 2.807862 -0.200784
O  -1.048162 -3.00213 0.23773
N  -0.800151 1.177106 -0.000502
C  -1.998498 0.453733 -0.5374
C  -2.220935 -0.858853 0.2476
C  0.38459 0.415104 -0.000738
C  0.329562 -1.028854 -0.008053
C  -0.973838 -1.740067 0.154452
C  -3.250949 1.340937 -0.593458
C  -1.02288 2.194956 1.051976
C  1.690689 0.992496 -0.052204
C  1.515842 -1.806122 -0.075184
C  2.860986 0.220444 -0.091619
C  2.778342 -1.195679 -0.105095
H  -1.735312 0.175369 -1.579503
H  -3.08435 -1.426018 -0.14213
H  -2.426259 -0.647162 1.317587
H  -3.617755 1.611597 0.412525
H  -3.057399 2.267957 -1.1613
H  -4.059089 0.790649 -1.107076
H  -0.057261 2.576197 1.411476
H  -1.570789 1.772442 1.922022
H  -1.594479 3.050485 0.65638
H  1.403009 -2.895277 -0.075801
H  3.831533 0.723327 -0.145244
H  3.693858 -1.792996 -0.148155
