program: Gaussian 09
title: 000292045
version: EM64L-G09RevD.01
frameworkgroup: C1[X(C15H17N3O2S)]
method: RPBEPBE
basis: SDD
operation: Freq
keyword: #p
keyword: freq=noraman
keyword: PBEPBE/SDD
title: #p freq=noraman PBEPBE/SDD
converged: NO YES NO NO
title: Mulliken charges:
elementType: S O O N N N C C C C C C C C C C C C C C C H H H H H H H H H H H H H H H H H
charge: 0.044066 -0.205767 -0.215042 -0.158931 -0.136402 -0.267950 0.340741 -0.363748 -0.234219 0.124395 -0.299285 -0.661394 -0.610505 0.469243 0.180371 -0.372892 -0.294621 -0.788313 -0.207333 -0.220079 -0.240940 0.259859 0.214535 0.243454 0.215859 0.250297 0.227087 0.254309 0.261217 0.253731 0.240758 0.252019 0.276015 0.235296 0.252287 0.225978 0.227712 0.228192
chargesum: 0.00000
title: Mulliken charges with hydrogens summed into heavy atoms:
elementType: S O O N N N C C C C C C C C C C C C C C C
charge: 0.044066 -0.205767 -0.215042 -0.158931 -0.136402 -0.267950 0.340741 0.110646 -0.234219 0.124395 -0.055831 0.031849 0.158751 0.469243 0.180371 -0.132134 -0.042602 -0.024715 0.018646 0.007633 -0.012748
polarizability: 3.32011439e+02 1.68129282e+01 2.20076616e+02 -1.81577845e+01 1.93596304e-01 1.48683737e+02
1716.lowfreq: -9.1394 -0.0009 -0.0004 0.0007 1.5110 5.1501 20.7506 37.4648 53.7694
frequency: 20.6586 37.4320 53.7348 66.1197 70.3273 74.7848 80.3624 82.3277 104.8335 128.8137 140.1750 174.5325 187.4950 199.5734 213.6486 233.3662 247.7255 295.9786 303.1574 312.9593 349.3731 362.3279 377.8673 406.3036 428.6946 444.8120 488.3957 496.4013 529.6701 571.7870 577.5246 602.6092 615.2049 634.0700 637.1460 666.1745 691.8080 740.3633 743.1571 769.7502 794.0634 819.9451 837.2018 873.6673 900.4274 914.1639 931.1898 969.5935 984.6817 990.6135 991.7042 1012.6751 1027.4565 1032.1796 1050.2146 1085.0084 1088.7943 1117.4197 1130.0911 1137.2416 1155.6442 1172.6297 1187.2210 1220.7664 1239.6266 1286.8564 1298.8598 1319.1114 1329.2908 1353.3119 1365.8296 1373.1735 1381.5740 1385.7369 1390.9120 1404.6737 1441.6289 1443.1375 1449.6274 1464.7502 1466.0284 1468.1373 1469.9925 1479.3205 1483.3503 1485.0616 1596.2167 1603.2380 1612.3136 1633.4583 1658.2995 2984.1930 2987.7257 2996.8040 3004.5813 3060.8145 3072.7170 3085.9700 3098.5163 3099.4658 3121.5199 3126.7794 3128.5314 3132.1927 3137.1965 3149.4274 3163.6620 3187.9862
redmass: 4.7586 7.1484 3.6317 5.9314 2.9709 4.7142 3.7175 1.0435 4.3555 5.8628 5.2946 1.2336 2.7370 1.6376 2.3456 4.4946 3.7710 3.2362 3.9478 4.4260 3.9389 4.9990 4.6542 2.8321 3.9626 6.0373 9.1610 3.6988 4.4702 4.3043 3.6594 4.2495 5.6064 6.6858 6.2551 4.1604 1.9462 2.7604 7.7555 2.0840 1.4643 1.6334 1.2545 2.9852 2.5373 2.1384 2.4950 1.3868 2.2228 5.5326 1.3798 2.9961 2.0241 1.7166 3.2931 1.5556 1.9645 2.3744 1.3237 2.6364 2.8780 1.0515 1.1423 2.5711 3.7203 1.8768 4.1172 1.4381 2.8137 2.8522 1.5522 2.1365 1.5099 8.3147 1.2838 1.8548 1.9417 1.4878 1.0861 1.0812 1.0421 1.0552 1.0505 2.2801 1.0712 1.0559 6.7011 6.6922 8.1929 10.1891 8.2462 1.0396 1.0361 1.0626 1.0326 1.0999 1.0958 1.0997 1.1022 1.1012 1.1020 1.0850 1.0930 1.0943 1.0890 1.0943 1.0993 1.0967
irintensity: 1.0743 0.3100 0.3519 1.1754 0.8293 0.7225 5.3060 0.2353 1.0726 10.3631 3.3649 0.5930 1.1039 0.2217 0.9676 0.7714 2.9017 9.1486 2.8663 1.6812 1.0912 7.2324 0.2048 0.1085 30.2615 3.9799 29.6220 15.0344 9.1580 7.7162 10.7524 19.5493 4.3458 8.8154 7.0899 23.4466 41.9058 33.6594 6.1412 12.1777 1.7193 64.7041 1.1771 16.6982 1.3857 4.0394 23.1285 3.2152 122.9680 3.5251 3.0549 10.7349 15.2432 12.3915 76.5653 11.4359 5.8224 79.1285 1.9890 23.8527 4.1745 0.2706 4.3168 32.4727 616.0230 96.9939 31.8616 2.4662 64.8000 89.6553 13.5411 355.3993 177.2135 7.6035 58.8375 31.8215 46.0502 54.2752 33.8733 10.5611 16.2904 37.4626 5.3948 40.6710 44.8431 6.2852 41.0704 67.0701 205.6513 215.2944 33.2075 5.0064 19.7040 30.8381 27.3953 0.7897 9.9120 39.2944 12.9126 14.9520 0.8611 1.1750 10.8634 19.7063 6.1067 29.6385 27.5911 2.2471
temp: 298.150 k
press: 1.00000 atm
elementType: 16 8 8 7 7 7 6 6 6 6 6 6 6 6 6 6 6 6 6 6 6 1 1 1 1 1 1 1 1 1 1 1 1 1 1 1 1 1
symmnumber: 1
zpe: 777618.4 jmol-1
zpe.correction: 0.296179 hartree
zpe.thermalcorrener: 0.317238 hartree
zpe.thermalcorrenthalpy: 0.318183 hartree
zpe.thermalcorrgfe: 0.244679 hartree
zpe.sumelectzpe: -1293.054097 hartree
zpe.sumelectthermal: -1293.033037 hartree
zpe.sumelectthermalent: -1293.032093 hartree
zpe.sumelectthermalfe: -1293.105597 hartree
dipole: -1.3690 2.0015 1.3522
dipole: 2.7764
quadrupole: -158.8744 -114.6950 -126.0531
quadrupole: -13.4410 2.7056 1.6488
quadrupole: -25.6669 18.5125 7.1544 -13.4410 2.7056 1.6488
hfenergy: -1293.3502758 hartree
pointgroup: C01 [X(C15H17N3O2S1)]
dipole: 0.5781103 -0.6329012 0.6770597 debye
polarizability: 318.5619004|35.2578754|227.4456207|34.189654|-1.9654012|154.7642707 unknown
InChI: InChI=1S/C15H17N3O2S/c1-4-17-13(14(20)16(3)15(17)21)10-18(11(2)19)12-8-6-5-7-9-12/h5-10H,4H2,1-3H3
charge 0 multiplicity 1
38 atoms
S  4.572227 1.583077 0.733545
O  0.028112 1.20516 -1.607916
O  -2.984261 -2.64305 -0.616756
N  2.339881 -0.079076 0.77578
N  2.159052 1.653052 -0.636974
N  -1.171671 -1.283101 0.002502
C  1.063278 -0.204987 0.172774
C  2.914803 -1.009961 1.760225
C  3.017105 1.048395 0.294966
C  0.940608 0.932518 -0.78517
C  0.176168 -1.229573 0.423564
C  3.553932 -2.254364 1.108365
C  2.484132 2.856404 -1.404199
C  -2.027606 -0.105584 0.102613
C  -1.753817 -2.53748 -0.373063
C  -2.019861 0.643866 1.302765
C  -2.874464 0.263029 -0.9652
C  -0.801523 -3.725535 -0.464231
C  -2.858417 1.772558 1.429008
C  -3.719795 1.383382 -0.826266
C  -3.714044 2.144085 0.366157
H  3.683072 -0.443839 2.315071
H  2.117205 -1.295231 2.472436
H  0.52021 -2.084571 1.015017
H  2.824408 -2.830064 0.510034
H  4.384157 -1.95308 0.446972
H  3.960418 -2.920447 1.890554
H  2.625195 3.717284 -0.729646
H  1.641237 3.046132 -2.087835
H  3.413318 2.705967 -1.978516
H  -1.372183 0.340151 2.132679
H  -2.864244 -0.312501 -1.89327
H  -1.347269 -4.552155 -0.942169
H  -0.478403 -4.064587 0.538966
H  0.101732 -3.488886 -1.053586
H  -2.852711 2.350097 2.360156
H  -4.375127 1.668984 -1.656114
H  -4.369256 3.016432 0.466861
