program: Gaussian 09
title: 000292191
version: EM64L-G09RevD.01
frameworkgroup: C1[X(C33H23N)]
method: RPBEPBE
basis: SDD
operation: Freq
keyword: #pfreq=noraman
keyword: PBEPBE/SDD
title: #p freq=noraman PBEPBE/SDD
converged: YES YES NO NO
title: Mulliken charges:
elementType: N C C C C C C C C C C C C C C C C C C C C C C C C C C C C C C C C C H H H H H H H H H H H H H H H H H H H H H H H
charge: -0.047274 -0.275257 0.101507 0.289909 0.052136 0.117487 0.279355 -0.717533 0.258036 0.213071 -0.591592 -0.390288 0.328135 -0.396481 0.312872 0.303281 -0.261983 -0.247264 -0.296556 -0.435621 -0.390262 -0.415772 -0.392267 -0.395970 -0.375320 -0.242734 -0.225013 -0.242607 -0.226381 -0.246235 -0.247570 -0.236386 -0.246418 -0.239547 0.243312 0.234349 0.242022 0.259182 0.265309 0.268196 0.230030 0.227391 0.257723 0.250769 0.242981 0.248580 0.240164 0.257179 0.227534 0.227482 0.226709 0.227044 0.229422 0.227792 0.231891 0.229594 0.231891
chargesum: 0.00000
title: Mulliken charges with hydrogens summed into heavy atoms:
elementType: N C C C C C C C C C C C C C C C C C C C C C C C C C C C C C C C C C
charge: -0.047274 -0.275257 0.101507 0.289909 0.052136 0.117487 0.279355 0.002149 0.258036 0.213071 -0.332409 -0.124980 0.328135 -0.128285 0.312872 0.303281 -0.031953 -0.019874 -0.296556 -0.177898 -0.139493 -0.172790 -0.143687 -0.155806 -0.118141 -0.015200 0.002469 -0.015899 0.000663 -0.016813 -0.019778 -0.004496 -0.016825 -0.007656
polarizability: 5.15619624e+02 6.61484563e+00 4.51055715e+02 6.66262648e+00 -3.95035962e+00 2.26797629e+02
1716.lowfreq: -3.2491 -0.0007 -0.0004 -0.0002 4.9340 6.0566 19.0427 37.5966 43.1472
frequency: 19.0056 37.5644 43.1384 49.7305 53.3446 59.3244 66.9601 67.7697 86.3358 87.6112 120.7997 132.6299 148.8004 178.1191 192.8009 202.4940 207.3119 219.0395 227.4005 252.8902 270.4911 278.0650 283.5433 291.2536 324.5920 357.3876 381.4486 403.7923 405.3329 405.8683 418.8944 436.9201 455.9806 470.8990 483.1347 500.7723 531.3093 556.7563 563.5969 580.4338 601.6129 610.2555 610.8840 616.3170 617.2348 631.7084 653.4074 673.5359 681.5859 689.3679 701.0236 703.7329 704.7206 717.5620 741.6368 758.3365 765.6984 774.5239 777.1973 788.0880 791.0289 829.1206 851.2770 852.8423 856.7776 877.9086 883.4335 913.7082 916.0286 925.0323 926.8921 941.5755 948.7913 953.0351 977.0979 978.3625 980.1211 988.3754 988.6314 989.0191 989.6688 996.0681 996.8277 997.2880 1000.6095 1024.8919 1027.7175 1028.1777 1029.2490 1054.8983 1065.2149 1081.3426 1083.2954 1085.1568 1105.8578 1128.8188 1166.8537 1173.0867 1173.5452 1175.1517 1175.3596 1188.3484 1190.8529 1192.9847 1196.6037 1209.9482 1237.2719 1261.8173 1289.4097 1304.6654 1311.9939 1316.9650 1324.1215 1339.3676 1369.3864 1373.6445 1375.3898 1377.1238 1386.7113 1406.1423 1432.2282 1432.9415 1437.3559 1448.2095 1456.7290 1464.2709 1467.7735 1477.6253 1482.0283 1484.5637 1509.8853 1561.0205 1571.5890 1580.6058 1582.3505 1588.2110 1592.8474 1608.7585 1609.4144 1611.0232 1613.4559 2130.0398 2983.3677 3089.9795 3091.8890 3122.6352 3122.8311 3124.1918 3129.2938 3129.3782 3130.5897 3133.1491 3140.9925 3142.0769 3144.5043 3144.9644 3148.3938 3150.8268 3151.9297 3155.7072 3157.0265 3165.6741 3166.0770 3168.1806 3169.0204
redmass: 5.7143 6.7967 5.0136 4.5675 5.0451 4.1198 4.0467 4.7887 5.0769 4.4998 4.8448 5.2881 6.5699 5.1225 3.9361 4.1912 3.7897 5.1681 5.1165 4.5607 1.6697 2.1017 4.2352 4.7522 4.7282 5.2561 5.6282 2.8807 2.8668 2.8971 4.8515 3.6432 4.9598 3.7741 5.7033 4.5692 5.0049 4.6474 6.8197 4.2504 5.3538 6.8789 6.0954 6.4273 6.4186 4.9784 6.0602 5.8467 6.0375 5.5863 1.7342 1.8976 1.7068 3.6790 3.2343 2.3666 1.6059 2.1500 1.9623 3.0817 4.1623 4.9369 1.2487 1.2500 1.2458 1.4843 1.4008 2.5813 2.4477 1.4672 1.4823 2.0632 3.5105 1.4248 1.3927 1.3971 1.4027 2.9731 5.6080 5.7113 1.7645 1.3186 1.3424 1.3212 5.3720 2.2972 2.2387 2.1856 2.2417 2.0639 2.2076 1.7075 1.6565 1.5966 2.0200 2.9215 3.5300 1.0545 1.0568 1.0749 1.2038 1.7890 1.2394 1.1766 1.1506 3.4349 4.0426 2.1332 1.5288 1.9392 1.8677 1.4190 1.8635 2.2170 4.7907 1.7493 6.4345 2.4224 4.3996 5.1765 2.3471 2.2883 2.3566 2.2906 2.0626 1.2017 1.1465 2.3252 2.5827 2.4601 6.6376 6.5948 6.6392 5.9755 5.9829 6.4955 7.4785 6.1560 6.5979 6.0798 6.3440 12.6267 1.0326 1.1016 1.1014 1.0852 1.0851 1.0855 1.0871 1.0858 1.0871 1.0876 1.0920 1.0923 1.0921 1.0902 1.0903 1.0959 1.0963 1.0960 1.0948 1.1015 1.1015 1.0995 1.1012
irintensity: 0.0645 1.4977 0.1580 0.0598 0.1233 0.4377 0.1320 0.1020 0.3581 0.3865 1.2395 2.1098 2.8069 0.3738 0.6487 0.2591 0.4792 0.2644 0.0993 0.0996 0.0533 1.1669 0.2980 2.0421 0.8861 0.2399 3.3457 0.4880 0.4358 0.4991 3.1044 1.4102 2.0615 1.6955 1.2987 5.7583 4.6889 15.6805 12.4729 3.7998 3.0026 1.1596 3.3835 1.0405 0.5597 6.9179 0.2114 8.1784 4.7447 4.5951 61.4769 36.3806 40.5828 14.8255 34.7412 15.8416 26.9916 14.1210 84.6490 17.2315 3.3979 1.1907 4.7103 0.6857 1.9780 14.0840 0.3363 1.0973 2.5549 0.6983 2.0377 0.9540 17.7289 1.1038 1.6327 0.4069 0.5863 1.8825 0.8854 1.1241 0.1479 0.2486 0.3614 0.0658 7.1327 1.7109 14.5724 3.6187 7.2470 2.4985 3.9128 4.3015 15.2459 8.6030 4.8518 0.2148 3.5888 0.0157 0.0660 0.0180 1.8151 1.7342 3.2868 1.7717 3.4136 4.1716 0.7276 2.6993 0.5997 5.5114 22.4380 4.3716 8.2139 27.6842 4.6174 9.6981 0.7040 8.1834 34.8341 5.3032 6.4832 10.6214 6.8971 9.5335 4.4063 13.1682 8.3121 5.2664 48.1083 32.9763 112.0299 8.5255 54.3552 1.6917 5.2148 8.4056 9.5883 0.5283 0.1942 0.1520 1.1907 82.0696 22.8578 15.5971 10.8733 4.0945 3.8095 6.1463 0.2310 1.8663 2.2077 1.2340 12.9629 23.8430 19.7471 8.2130 8.3030 25.7778 29.2920 32.6824 17.2432 26.8108 30.4856 27.0049 19.4508
temp: 298.150 k
press: 1.00000 atm
elementType: 7 6 6 6 6 6 6 6 6 6 6 6 6 6 6 6 6 6 6 6 6 6 6 6 6 6 6 6 6 6 6 6 6 6 1 1 1 1 1 1 1 1 1 1 1 1 1 1 1 1 1 1 1 1 1 1 1
symmnumber: 1
zpe: 1175082.6 jmol-1
zpe.correction: 0.447565 hartree
zpe.thermalcorrener: 0.474792 hartree
zpe.thermalcorrenthalpy: 0.475736 hartree
zpe.thermalcorrgfe: 0.389460 hartree
zpe.sumelectzpe: -1323.781375 hartree
zpe.sumelectthermal: -1323.754149 hartree
zpe.sumelectthermalent: -1323.753204 hartree
zpe.sumelectthermalfe: -1323.839481 hartree
dipole: -3.6173 -3.6551 -0.1441
dipole: 5.1445
quadrupole: -183.3966 -185.9676 -192.8155
quadrupole: -15.0075 4.0848 -3.1757
quadrupole: 3.9967 1.4256 -5.4223 -15.0075 4.0848 -3.1757
hfenergy: -1324.2289405 hartree
pointgroup: C01 [X(C33H23N1)]
dipole: 1.5535302 -1.2949925 0.0780051 debye
polarizability: 515.4131074|-0.8777544|449.9404279|17.0695824|10.9477362|228.1194329 unknown
InChI: InChI=1S/C33H23N/c1-33-29-20-12-11-19-26(29)31(25-17-9-4-10-18-25)32(33)28(24-15-7-3-8-16-24)21-27(30(33)22-34)23-13-5-2-6-14-23/h2-21H,1H3
charge 0 multiplicity 1
57 atoms
N  -3.990643 2.524289 0.084615
C  -0.759838 1.215532 0.901647
C  0.40278 0.322387 0.440709
C  -0.251789 2.618935 0.573669
C  1.477643 1.097281 0.008927
C  1.089364 2.523131 0.094794
C  -2.079779 0.731933 0.261468
C  -0.94158 1.106724 2.462718
C  0.177635 -1.12279 0.45115
C  -2.249021 -0.632061 0.020018
C  -1.137046 -1.543773 0.270968
C  -0.86314 3.870825 0.745825
C  2.784005 0.652855 -0.539436
C  1.813019 3.688542 -0.25023
C  1.266855 -2.11924 0.642499
C  -3.531933 -1.220326 -0.468462
C  -0.134408 5.039426 0.403697
C  1.18888 4.947495 -0.092408
C  -3.141683 1.677341 0.146744
C  3.999324 1.20428 -0.047379
C  2.849235 -0.30384 -1.588292
C  1.239251 -3.378361 -0.01992
C  2.339452 -1.850492 1.536978
C  -4.033396 -2.426216 0.097485
C  -4.269332 -0.608431 -1.518436
C  5.243208 0.795471 -0.574229
C  4.091962 -0.705991 -2.121031
C  2.246254 -4.338586 0.20925
C  3.345264 -2.810739 1.768091
C  5.294984 -0.160944 -1.614896
C  -5.242113 -2.991267 -0.360707
C  -5.47361 -1.178296 -1.981756
C  3.304231 -4.06032 1.106451
C  -5.967416 -2.370849 -1.404558
H  -1.761892 1.767504 2.793565
H  -0.012583 1.412724 2.97531
H  -1.186262 0.068366 2.74671
H  -1.352524 -2.616968 0.254802
H  -1.889952 3.957394 1.113753
H  2.831874 3.61985 -0.643997
H  -0.606622 6.021772 0.513949
H  1.731937 5.86105 -0.359313
H  3.968523 1.932464 0.771333
H  1.919999 -0.720681 -1.990803
H  0.442391 -3.592267 -0.741651
H  2.372877 -0.887551 2.05768
H  -3.493824 -2.906041 0.922273
H  -3.889118 0.304592 -1.987864
H  6.169797 1.221623 -0.173271
H  4.121686 -1.443863 -2.93037
H  2.213272 -5.298243 -0.318765
H  4.162028 -2.584742 2.462465
H  6.259946 -0.475629 -2.027648
H  -5.619967 -3.911162 0.099155
H  -6.023524 -0.691949 -2.794702
H  4.089178 -4.804306 1.282113
H  -6.904263 -2.811462 -1.762985
