program: Gaussian 09
title: 000292078
version: EM64L-G09RevD.01
frameworkgroup: C1[X(C24H20N6O2)]
method: RPBEPBE
basis: SDD
operation: Freq
keyword: #p
keyword: freq=noraman
keyword: PBEPBE/SDD
title: #p freq=noraman PBEPBE/SDD
converged: YES YES NO NO
title: Mulliken charges:
elementType: O O N N N N N N C C C C C C C C C C C C C C C C C C C C C C C C H H H H H H H H H H H H H H H H H H H H
charge: -0.267478 -0.267464 -0.277590 -0.277581 -0.016698 -0.016701 -0.023384 -0.023386 0.404155 0.404157 0.359124 0.359127 -0.473897 -0.473903 0.029045 0.029050 0.155637 0.155612 -0.747031 -0.747029 0.428393 0.428394 -0.785724 -0.785726 -0.361219 -0.361217 -0.374413 -0.367185 -0.367189 -0.374411 -0.228641 -0.228638 0.242468 0.242468 0.255404 0.224582 0.255341 0.255406 0.255338 0.224581 0.242798 0.266367 0.242941 0.242659 0.243081 0.266366 0.312617 0.312609 0.239339 0.265056 0.265055 0.239338
chargesum: 0.00000
title: Mulliken charges with hydrogens summed into heavy atoms:
elementType: O O N N N N N N C C C C C C C C C C C C C C C C C C C C C C C C
charge: -0.267478 -0.267464 -0.277590 -0.277581 -0.016698 -0.016701 -0.023384 -0.023386 0.404155 0.404157 0.359124 0.359127 -0.231429 -0.231436 0.029045 0.029050 0.155637 0.155612 -0.011705 -0.011705 0.428393 0.428394 -0.033618 -0.033620 -0.048602 -0.048608 -0.135073 -0.102129 -0.102134 -0.135073 -0.228641 -0.228638
polarizability: 8.35262260e+02 -1.28973316e+01 3.52363410e+02 1.89963787e-01 1.94155428e-01 1.33565569e+02
1716.lowfreq: -35.6508 -35.4202 -7.3348 -3.1861 -2.1427 -0.0016 -0.0007 0.0017 10.1302
frequency: -35.6464 -35.4160 10.1302 12.4945 23.3716 27.6865 40.1670 55.3315 62.6013 78.7425 79.4119 101.5254 106.6366 124.3821 157.6326 160.2283 166.4263 181.6179 185.9701 195.7496 210.1539 220.8023 220.8650 242.7500 242.8307 265.4722 267.1358 292.1562 295.4526 314.6575 358.2879 361.1592 372.6017 407.4206 407.4470 407.5093 417.5927 435.3475 437.2498 456.1975 467.2836 472.6582 486.1689 486.8052 528.7139 539.1770 578.5083 578.5313 597.6551 601.0213 617.6090 620.2357 624.8789 634.2108 641.6602 646.9127 690.7655 707.9752 748.6260 758.9318 761.2918 825.8253 847.1774 847.3554 855.4524 856.3810 857.1312 879.4434 887.9166 955.4090 955.6867 978.2182 992.6521 1002.6390 1005.3471 1006.9760 1017.6999 1017.7208 1033.8510 1034.4491 1039.9964 1040.0053 1047.3838 1047.4041 1056.9342 1057.3002 1113.6681 1120.8263 1127.2913 1177.5867 1212.7334 1212.9520 1229.0812 1229.1196 1231.4545 1242.5705 1308.7944 1330.6555 1340.1648 1367.0184 1374.0616 1381.5523 1396.9042 1398.3470 1401.1113 1401.4396 1406.2968 1406.3053 1419.9003 1448.7258 1448.7318 1458.6772 1458.6857 1469.5035 1469.5064 1470.5735 1470.9626 1505.1627 1511.9142 1535.8292 1546.5988 1547.4292 1562.0443 1570.4194 1576.7377 1618.2233 1631.7130 1632.6590 2176.3679 2176.4423 2985.6388 2985.6453 3001.7037 3001.7063 3062.3251 3062.3328 3085.1584 3085.1639 3110.5091 3110.5158 3111.7043 3111.7941 3124.6076 3124.7598 3131.4554 3132.5906 3166.9065 3169.8446 3170.8678 3170.8727
redmass: 1.0253 1.0254 6.7320 5.3598 6.3585 5.0233 4.3007 6.9124 6.5742 5.4080 5.3374 7.8366 5.6400 10.6356 8.9233 4.8784 3.8756 2.2214 2.1986 5.3991 2.9888 1.4261 1.4432 4.4121 4.3322 4.0534 4.4333 2.8295 3.5377 4.1776 6.6315 5.8838 6.1563 6.0224 5.6878 2.9024 6.0445 5.6223 6.3252 10.0978 7.4229 6.5243 5.6196 5.9674 6.3978 2.8322 6.0983 6.0546 4.4441 3.8614 4.4172 4.6035 5.3927 6.3068 4.2357 4.6634 6.8827 6.7958 4.0279 8.6211 7.1673 4.3226 1.2489 1.2477 1.2557 6.1731 1.5047 7.5731 6.2812 2.0850 2.0772 1.3516 1.4322 1.4545 2.7895 1.4835 2.7741 2.9068 2.0448 2.0561 1.5749 1.5749 1.5383 1.5384 3.1048 3.1359 1.7769 5.2910 2.7812 1.1508 3.4489 3.4165 2.2558 2.2823 1.6959 2.1688 1.5158 2.2541 2.0809 4.4466 3.3265 3.0440 1.7442 1.5869 1.6849 1.9444 1.2545 1.2503 4.4638 1.0469 1.0469 1.1612 1.1615 1.0460 1.0458 1.2369 1.2371 2.8371 7.3293 7.8141 5.5029 5.2964 7.8956 6.9220 6.2141 6.3618 6.9135 6.9218 12.6313 12.6313 1.0384 1.0384 1.0364 1.0364 1.0968 1.0968 1.0966 1.0966 1.0986 1.0986 1.1009 1.1009 1.0920 1.0919 1.0896 1.0894 1.0943 1.0954 1.0924 1.0924
irintensity: 0.7941 0.7786 7.8874 2.4172 1.8838 0.0000 0.0000 3.9337 0.0000 0.4875 0.0000 0.0000 0.0000 9.2889 0.0000 2.2689 0.0000 0.1189 0.0000 2.7960 19.8639 0.0387 5.6501 0.0032 10.7181 0.0000 3.6849 0.0000 11.8754 0.0000 0.0000 4.9348 8.7585 0.0035 10.4431 0.3144 48.0868 0.0000 0.0000 6.0223 0.0000 0.0000 0.0321 0.0000 10.9415 20.7000 20.7433 0.0108 0.0001 20.1152 0.0000 0.1830 0.0000 0.0000 9.4335 0.0000 13.4896 0.0000 0.0000 7.3343 0.0000 35.9975 28.0864 0.0000 0.0000 0.0000 43.9411 10.4241 0.0000 5.9955 0.0000 0.0000 26.4132 31.8669 10.0968 0.0001 18.1948 0.0436 0.0006 76.9223 0.3496 17.3438 0.0289 23.0240 100.5546 0.0015 1.4788 0.0000 47.0621 0.0000 128.0779 0.0028 10.1878 0.0169 187.9123 0.0001 0.0000 31.1636 0.0000 248.4188 0.0000 15.3727 365.6123 0.0012 2.5029 0.0003 36.0143 0.0009 9.4169 0.0538 30.8340 52.4622 1.6037 0.9206 31.0130 0.0216 52.1069 17.4910 0.0000 1.8148 0.0000 97.2657 0.0000 558.2362 0.0000 0.0000 616.9209 0.0009 91.5170 0.1230 16.4775 3.9967 18.3860 1.6001 7.9032 12.3852 4.0509 9.2076 18.2498 0.0166 66.2233 0.0177 6.3557 0.0259 13.5505 0.0000 10.2669 0.0000 7.9101 1.6890
temp: 298.150 k
press: 1.00000 atm
elementType: 8 8 7 7 7 7 7 7 6 6 6 6 6 6 6 6 6 6 6 6 6 6 6 6 6 6 6 6 6 6 6 6 1 1 1 1 1 1 1 1 1 1 1 1 1 1 1 1 1 1 1 1
symmnumber: 1
zpe: 1018991.1 jmol-1
zpe.correction: 0.388113 hartree
zpe.thermalcorrener: 0.417045 hartree
zpe.thermalcorrenthalpy: 0.417989 hartree
zpe.thermalcorrgfe: 0.325033 hartree
zpe.sumelectzpe: -1403.227012 hartree
zpe.sumelectthermal: -1403.198080 hartree
zpe.sumelectthermalent: -1403.197136 hartree
zpe.sumelectthermalfe: -1403.290092 hartree
dipole: -0.0009 -0.0001 0.0000
dipole: 0.0009
quadrupole: -197.4123 -197.7137 -188.0070
quadrupole: 109.4020 -0.0994 0.0822
quadrupole: -3.0346 -3.3360 6.3706 109.4020 -0.0994 0.0822
hfenergy: -1403.615125 hartree
pointgroup: C01 [X(C24H20N6O2)]
dipole: -0.0003535 0.0000381 -0.0000223 debye
polarizability: 833.6359419|-5.3538312|335.4798823|36.6039636|57.6021397|152.0754153 unknown
InChI: InChI=1S/C24H20N6O2/c1-15-9-17(3)29(23(31)21(15)11-25)27-13-19-5-7-20(8-6-19)14-28-30-18(4)10-16(2)22(12-26)24(30)32/h5-10,13-14H,1-4H3
charge 0 multiplicity 1
52 atoms
O  -5.20276 -1.650534 -0.759494
O  5.203499 1.650607 0.758321
N  -5.069154 0.629013 -0.100204
N  5.069612 -0.629066 0.099501
N  -3.663174 0.715142 0.003651
N  3.663628 -0.715062 -0.004406
N  -8.647822 -2.553478 -1.199739
N  8.648667 2.553131 1.198666
C  -5.713455 1.839357 0.210268
C  5.713768 -1.839561 -0.210675
C  -7.910485 0.789032 -0.206833
C  7.910912 -0.789473 0.206415
C  -7.100076 1.909765 0.155598
C  7.100371 -1.910167 -0.155842
C  -7.2668 -0.420483 -0.517302
C  7.267376 0.420202 0.516568
C  -5.809216 -0.571583 -0.48308
C  5.809816 0.571505 0.482195
C  -4.867918 3.025737 0.593504
C  4.868091 -3.025902 -0.593724
C  -1.41661 -0.12139 -0.115681
C  1.417106 0.121571 0.114743
C  -9.414253 0.93997 -0.243992
C  9.414673 -0.940526 0.243338
C  -2.868678 -0.309872 -0.253049
C  2.869176 0.310024 0.252142
C  -0.564278 -1.231077 -0.39298
C  0.829564 -1.114192 -0.280263
C  -0.82907 1.114376 0.279317
C  0.564775 1.231263 0.392026
C  -8.009534 -1.590055 -0.890288
C  8.010251 1.589745 0.88936
H  -7.57729 2.861634 0.400388
H  7.577463 -2.862167 -0.400358
H  -4.158039 3.287561 -0.209805
H  -5.519341 3.89055 0.79804
H  -4.258862 2.810806 1.488545
H  4.158137 -3.287478 0.209598
H  4.259111 -2.811059 -1.488838
H  5.519409 -3.890841 -0.798063
H  -9.705492 1.733039 -0.957871
H  -9.919382 0.007206 -0.538647
H  -9.797003 1.243122 0.748502
H  9.705793 -1.737409 0.952961
H  9.797713 -1.238276 -0.750711
H  9.919666 -0.009253 0.542905
H  -3.23595 -1.294656 -0.562493
H  3.236476 1.294823 0.561501
H  -1.012032 -2.184766 -0.697277
H  1.484173 -1.964609 -0.492419
H  -1.483677 1.964794 0.491473
H  1.01253 2.184956 0.696311
