program: Gaussian 09
title: 000292001
version: EM64L-G09RevD.01
frameworkgroup: C1[X(C7H9BrN2)]
method: RPBEPBE
basis: SDD
operation: Freq
keyword: #p
keyword: freq=noraman
keyword: PBEPBE/SDD
title: #p freq=noraman PBEPBE/SDD
converged: NO YES NO NO
title: Mulliken charges:
elementType: Br N N C C C C C C C H H H H H H H H H
charge: -0.035437 -0.413394 -0.576176 0.454624 0.576274 -0.337801 -0.404754 -0.420366 -0.352725 -0.809580 0.243159 0.226581 0.270861 0.230100 0.227546 0.222749 0.296136 0.301371 0.300834
chargesum: 0.00000
title: Mulliken charges with hydrogens summed into heavy atoms:
elementType: Br N N C C C C C C C
charge: -0.035437 -0.117258 0.026029 0.454624 0.576274 -0.094641 -0.178173 -0.420366 -0.081865 -0.129185
polarizability: 1.46601588e+02 -3.66786907e+00 1.25827775e+02 6.84740658e-02 -5.92706576e-02 4.93806845e+01
1716.lowfreq: -26.6395 -7.7985 -0.0006 -0.0003 0.0005 4.4290 5.4362 80.6844 127.5678
frequency: -26.3936 80.6792 127.5672 157.3844 165.9008 197.5624 275.8512 297.2460 331.1141 343.4898 415.8417 434.6973 443.8312 543.5290 574.2572 592.7952 659.6581 713.5742 761.8034 836.7677 845.7946 872.4042 963.2175 990.4825 1009.9366 1045.7499 1121.2870 1176.9147 1211.8931 1226.8689 1255.5766 1321.1395 1356.0644 1397.5062 1408.1295 1453.3836 1470.5568 1479.4071 1508.5218 1565.7075 1622.2242 1664.3370 2972.3910 3048.7634 3080.7751 3126.1797 3145.5543 3166.8781 3461.3107 3480.1126 3593.8792
redmass: 1.0319 3.2726 4.1783 6.5103 4.0340 4.1901 1.1046 6.7969 4.5219 3.1999 1.3494 3.4201 4.3531 1.9952 1.3546 5.5403 7.3180 3.6624 5.0410 1.3612 5.9494 1.3393 1.3314 1.4637 2.8414 1.5006 1.4893 2.5961 2.0401 1.1760 1.6316 2.3820 4.4722 1.2260 4.9479 1.5799 1.0462 1.1935 2.5829 4.3336 4.1561 1.2506 1.0373 1.0978 1.0983 1.0894 1.0919 1.0936 1.0415 1.0751 1.1067
irintensity: 0.3369 16.0440 0.2199 3.3574 0.0771 4.2092 89.5801 0.8870 13.6326 0.8482 254.6563 6.5455 5.5466 7.0671 47.2626 6.9275 17.7528 0.7806 14.2919 51.5003 17.2372 2.8825 4.5457 17.6572 20.2027 10.3810 6.6047 8.2499 16.9144 1.3865 3.1189 15.5052 25.0125 4.7790 0.6682 11.5607 12.6517 25.4353 164.0517 11.7519 25.6012 41.3680 53.8555 24.7834 19.7028 19.8068 6.2727 3.4940 1.6947 25.3478 3.7640
temp: 298.150 k
press: 1.00000 atm
elementType: 35 7 7 6 6 6 6 6 6 6 1 1 1 1 1 1 1 1 1
symmnumber: 1
zpe: 388765.4 jmol-1
zpe.correction: 0.148073 hartree
zpe.thermalcorrener: 0.157991 hartree
zpe.thermalcorrenthalpy: 0.158935 hartree
zpe.thermalcorrgfe: 0.112008 hartree
zpe.sumelectzpe: -394.334249 hartree
zpe.sumelectthermal: -394.324331 hartree
zpe.sumelectthermalent: -394.323387 hartree
zpe.sumelectthermalfe: -394.370314 hartree
dipole: -0.6510 2.2586 -0.0174
dipole: 2.3506
quadrupole: -59.5328 -58.2390 -71.4543
quadrupole: -8.8837 0.0777 -0.0639
quadrupole: 3.5426 4.8364 -8.3790 -8.8837 0.0777 -0.0639
hfenergy: -394.4823219 hartree
pointgroup: C01 [X(C7H9Br1N2)]
dipole: -0.6939513 -0.6113069 -0.004194 debye
dipolederiv: -0.2527509 0.2258299 0.0175622 0.2456481 -0.6209256 -0.0364986 0.0188666 -0.0377485 -0.0659884 -0.9650907 0.038514 0.0111199 0.0211601 0.0828273 0.033057 -0.0059535 0.0273217 -0.4955317 -0.3967767 0.2396228 0.0255842 0.4897463 -0.3171769 -0.0379075 0.0442061 -0.0266603 0.0254963 0.1836087 0.0221419 -0.0091315 -0.016623 -0.190503 -0.0054259 -0.0343421 -0.005507 -0.0688785 1.3409747 0.3093463 -0.0155572 -0.0384766 -0.4186677 -0.0282336 -0.0318785 -0.039149 0.1367896 -0.0341342 -0.0774998 -0.0072998 0.2328225 -0.132304 -0.0103832 0.0120434 -0.0036629 -0.1044782 0.0558288 0.1836681 0.002977 -0.0722376 0.1788716 0.0215873 -0.0082479 0.0139489 -0.1611438 -0.0804039 -0.3353628 -0.0200156 -0.7148012 0.9806686 0.0831894 -0.0390561 0.074509 -0.1635993 -0.2866093 -0.2681407 -0.0113394 0.3122942 0.035423 0.0021632 0.020392 0.0206879 -0.203033 -0.0527592 -0.0160297 0.0028019 -0.0462097 0.0508871 -0.0008153 0.0263922 -0.0010839 0.0855335 0.0532486 -0.081014 -0.0019865 -0.0893739 -0.0171941 -0.0059279 -0.0034933 -0.0068151 0.1519126 0.0223406 0.1099435 0.0086413 0.1014019 -0.0770339 -0.0153974 0.0078928 -0.0143141 0.1488378 0.0825662 -0.0306086 0.0007586 -0.0492273 -0.0237413 -0.0087619 -0.0014514 -0.0091108 0.1736459 -0.051738 -0.0121375 0.0564469 -0.0517182 0.0632908 0.1004813 0.1311456 0.0762661 -0.0647167 -0.0456038 -0.0187529 -0.0500665 -0.0679514 0.0472365 -0.1060266 -0.1273368 -0.0808806 -0.0382887 0.0303025 0.0305824 0.0012036 0.1363215 -0.1305269 0.0040902 -0.0026648 0.0024209 0.1075845 0.1466308 -0.0227342 0.0059545 -0.0543868 0.0733023 -0.0134624 0.0095411 -0.0150107 0.3454117 0.1210424 -0.1442787 -0.0884467 -0.1626901 0.2065413 0.0518803 -0.0727303 0.0174064 0.1042972 0.1293234 -0.15309 0.070793 -0.1756988 0.2090249 -0.0276085 0.0566747 0.007382 0.0861491 unknown
polarizability: 143.8103092|-7.7206691|128.2860779|-3.3579962|4.3639908|49.7136599 unknown
InChI: InChI=1S/C7H9BrN2/c1-5-2-3-7(10-9)6(8)4-5/h2-4,10H,9H2,1H3
charge 0 multiplicity 1
19 atoms
Br -1.05091 2.816302 0.249397
N  -2.349632 -0.069452 0.130023
N  -3.125513 -1.23005 0.102592
C  1.937869 -0.220814 0.002022
C  -0.950464 -0.128912 0.088376
C  1.249286 1.017738 0.087363
C  1.155471 -1.402533 -0.037285
C  -0.153688 1.050321 0.127767
C  -0.251624 -1.365292 0.004468
C  3.456091 -0.260708 -0.051287
H  1.812041 1.956778 0.122036
H  1.658032 -2.375209 -0.102496
H  -0.855119 -2.277014 -0.025786
H  3.844263 0.211734 -0.973965
H  3.909103 0.274457 0.804311
H  3.826411 -1.30029 -0.029328
H  -2.791801 0.851333 0.199216
H  -3.65457 -1.39302 -0.756444
H  -3.587648 -1.480867 0.979224
