program: Gaussian 09
title: 000292007
version: EM64L-G09RevD.01
frameworkgroup: C1[X(C17H15NO2)]
method: RPBEPBE
basis: SDD
operation: Freq
keyword: #p
keyword: freq=noraman
keyword: PBEPBE/SDD
title: #p freq=noraman PBEPBE/SDD
converged: YES YES NO NO
title: Mulliken charges:
elementType: O O N C C C C C C C C C C C C C C C C C H H H H H H H H H H H H H H H
charge: -0.439650 -0.254265 -0.083467 -0.447739 -0.556575 -0.548768 0.267296 0.251234 -0.536886 -0.392122 0.472941 -0.393232 -0.398814 0.276331 -0.476131 -0.371979 0.269241 -0.190197 -0.349858 0.104595 0.227717 0.227242 0.232636 0.233449 0.233252 0.232910 0.284779 0.242031 0.229286 0.222310 0.283494 0.257355 0.232668 0.275853 0.383061
chargesum: 0.00000
title: Mulliken charges with hydrogens summed into heavy atoms:
elementType: O O N C C C C C C C C C C C C C C C C C
charge: -0.056588 -0.254265 -0.083467 0.007219 -0.090490 -0.082606 0.267296 0.251234 -0.252107 -0.150091 0.472941 -0.163946 -0.176504 0.276331 -0.192637 -0.114624 0.269241 0.042472 -0.074005 0.104595
polarizability: 3.87621289e+02 -2.02769127e+01 2.00850560e+02 2.54483436e+00 3.99885267e+00 1.02315888e+02
1716.lowfreq: -126.1309 -2.9185 -1.3236 -0.0008 -0.0007 -0.0003 5.0568 21.0399 39.2750
frequency: -126.1242 21.0153 39.2635 41.3845 65.0204 98.2959 122.1079 157.8483 174.8592 193.4700 209.1759 249.7164 289.7120 339.6028 354.9599 394.9859 424.5507 427.2751 444.6308 490.4271 514.3399 530.7401 561.5280 570.3074 593.0781 608.2375 625.3576 681.8107 690.9467 709.1060 721.5079 731.6443 743.1335 781.0042 800.7465 820.7736 829.9404 891.0927 897.0770 908.9904 922.4740 936.2973 939.4860 952.8437 955.3091 983.5021 994.3186 996.2909 1032.0873 1041.7186 1042.7209 1084.1475 1103.6396 1123.6177 1143.9436 1148.5532 1175.3197 1185.8454 1200.1005 1204.5389 1216.4199 1237.3873 1258.7330 1277.5594 1288.1136 1293.9693 1308.2145 1320.9000 1363.3388 1381.8688 1400.9556 1428.7408 1435.9493 1454.8614 1461.1823 1470.2389 1486.8254 1491.7147 1576.0598 1581.8133 1591.2423 1609.7831 1624.7113 1642.6717 2946.7118 2983.5673 2989.0191 3023.1665 3025.6055 3033.4138 3081.2142 3116.4343 3141.2142 3141.4082 3147.3504 3148.5564 3164.6861 3183.6965 3531.4939
redmass: 1.5977 4.8267 5.0011 6.1955 6.6431 5.0980 5.2345 4.6124 2.8750 3.7091 5.1534 4.8109 4.4212 3.3989 7.1933 4.4947 3.1454 2.7877 6.6381 5.0060 4.3216 3.3529 2.8317 5.4915 4.7142 1.7612 4.3508 6.0057 2.3343 2.2467 6.3141 3.7809 1.2302 4.9585 4.5900 1.5243 1.3716 4.8740 1.5204 3.0607 1.5885 1.4285 1.4209 2.9078 1.3832 4.1611 1.7029 1.4512 3.4788 1.7863 2.6582 1.6453 2.9028 1.6476 1.2005 1.6178 1.1189 1.7154 1.2004 1.9635 1.4316 1.0682 1.8264 1.3269 1.5318 2.0943 1.5035 2.2681 2.4859 6.2727 2.9147 3.7620 4.4322 1.1750 1.0862 2.4926 1.2380 2.1719 7.2188 6.7122 6.0704 6.4259 7.2023 8.5293 1.0862 1.0598 1.0598 1.0622 1.1023 1.1022 1.1047 1.0874 1.0880 1.0957 1.0926 1.0914 1.0945 1.0966 1.0641
irintensity: 0.4534 0.0681 1.1817 1.4545 0.1472 1.1006 1.0718 0.5876 0.1068 11.8082 4.8545 1.8568 1.4267 0.4933 9.7872 3.4474 6.7910 9.6601 9.9633 11.2485 7.1537 9.2785 4.3242 9.6441 60.7625 111.4218 19.2241 0.2029 4.0619 12.9652 7.6497 62.4431 4.7712 3.5413 1.6921 14.4804 46.5700 114.9362 10.5029 1.7433 16.5758 8.4411 2.3058 5.9012 0.7679 7.7797 11.1128 0.7454 0.8827 8.0145 264.3998 12.6541 19.6526 40.5096 0.0041 74.7931 5.1307 77.4243 0.0061 15.7828 2.6833 0.0147 17.7586 6.9657 27.2508 3.8636 7.3987 117.2832 4.1363 12.4571 16.4755 82.6024 31.3492 3.0410 15.0682 4.2539 27.2494 20.1719 187.0681 16.3610 98.8507 87.4951 11.1109 220.8603 50.7261 31.1811 24.9165 81.1130 12.8522 2.8415 48.0797 9.4229 20.2709 18.2727 0.7364 3.2496 9.6741 5.1966 48.1836
temp: 298.150 k
press: 1.00000 atm
elementType: 8 8 7 6 6 6 6 6 6 6 6 6 6 6 6 6 6 6 6 6 1 1 1 1 1 1 1 1 1 1 1 1 1 1 1
symmnumber: 1
zpe: 722408.1 jmol-1
zpe.correction: 0.275151 hartree
zpe.thermalcorrener: 0.291372 hartree
zpe.thermalcorrenthalpy: 0.292316 hartree
zpe.thermalcorrgfe: 0.229295 hartree
zpe.sumelectzpe: -860.621995 hartree
zpe.sumelectthermal: -860.605774 hartree
zpe.sumelectthermalent: -860.604829 hartree
zpe.sumelectthermalfe: -860.667851 hartree
dipole: 2.2383 0.7064 -0.7848
dipole: 2.4748
quadrupole: -87.6299 -111.3651 -118.6216
quadrupole: -4.2980 2.4499 2.5316
quadrupole: 18.2423 -5.4929 -12.7494 -4.2980 2.4499 2.5316
hfenergy: -860.8971456 hartree
pointgroup: C01 [X(C17H15N1O2)]
dipole: -0.883977 -0.4059609 -0.0428027 debye
polarizability: 387.9233005|-20.0180862|160.112148|1.6702319|-48.0695465|142.7522888 unknown
InChI: InChI=1S/C17H15NO2/c19-17(20)15-5-2-6-16(10-15)18-11-12-7-8-13-3-1-4-14(13)9-12/h2,5-11,19H,1,3-4H2
charge 0 multiplicity 1
35 atoms
O  6.326344 0.945572 -0.530147
O  4.519865 2.299264 -1.06737
N  0.445005 -0.712659 0.327734
C  -6.224061 -0.057819 1.098065
C  -4.833722 -0.551327 1.632015
C  -5.972156 0.627073 -0.290845
C  -3.831677 -0.147456 0.561138
C  -4.474198 0.516714 -0.519869
C  -2.442869 -0.35498 0.547784
C  -3.721657 0.977917 -1.622269
C  -1.675024 0.105955 -0.560588
C  -2.325655 0.7708 -1.638662
C  -0.218983 -0.087482 -0.615703
C  1.860046 -0.81001 0.294425
C  2.707746 0.232614 -0.166657
C  2.452042 -1.994656 0.818225
C  4.114984 0.077239 -0.128424
C  3.852988 -2.149481 0.839704
C  4.695303 -1.11858 0.36815
C  4.948098 1.208562 -0.61599
H  -6.683482 0.653786 1.805515
H  -6.925024 -0.903862 0.994001
H  -4.824068 -1.645676 1.794832
H  -4.583569 -0.089034 2.605643
H  -6.298982 1.684722 -0.290903
H  -6.537126 0.128073 -1.101589
H  -1.920258 -0.86245 1.36566
H  -4.212839 1.49134 -2.456751
H  -1.728075 1.124423 -2.488476
H  0.286189 0.313262 -1.521237
H  2.295472 1.18181 -0.526656
H  1.787924 -2.777967 1.197407
H  4.290199 -3.072457 1.235007
H  5.783431 -1.218691 0.391437
H  6.820086 1.738159 -0.872608
