program: Gaussian 09
title: 000292029
version: EM64L-G09RevD.01
frameworkgroup: C1[X(C16H15NO2S)]
method: RPBEPBE
basis: SDD
operation: Freq
keyword: #p
keyword: freq=noraman
keyword: PBEPBE/SDD
title: #p freq=noraman PBEPBE/SDD
converged: YES YES NO NO
title: Mulliken charges:
elementType: S O O N C C C C C C C C C C C C C C C C H H H H H H H H H H H H H H H
charge: 0.017240 -0.273937 -0.227456 -0.148598 0.431614 -0.515783 -0.489386 0.432619 -0.352651 -0.282402 -0.376214 -0.364531 0.283592 -0.211518 -0.219639 -0.235728 -0.232278 -0.220594 -0.233848 -0.500660 0.286382 0.274565 0.240089 0.254320 0.285696 0.265604 0.229159 0.229006 0.231147 0.229103 0.229923 0.231186 0.235609 0.250542 0.247822
chargesum: 0.00000
title: Mulliken charges with hydrogens summed into heavy atoms:
elementType: S O O N C C C C C C C C C C C C C C C C
charge: 0.017240 -0.273937 -0.227456 -0.148598 0.431614 0.045164 -0.489386 0.432619 -0.112562 -0.028082 -0.090517 -0.098927 0.283592 0.017641 0.009367 -0.004581 -0.003176 0.009330 -0.002662 0.233314
polarizability: 2.69128758e+02 -1.25072337e+01 1.88449355e+02 -5.48702466e+00 -8.62582063e+00 1.51224556e+02
1716.lowfreq: -15.4898 -7.6115 -0.0008 0.0011 0.0015 2.3944 11.2640 32.7081 37.2478
frequency: -2.7074 32.6054 37.2011 53.1125 54.1751 62.7777 78.1281 99.2952 115.8272 164.5248 178.0409 188.1075 227.4628 244.4646 264.9222 297.8302 335.2475 366.3976 404.7312 405.0200 450.5329 477.5681 488.0763 533.6767 575.4843 604.3603 611.8067 614.2286 634.5123 662.9450 690.3071 698.2475 703.0693 763.3894 768.7457 786.5474 794.2013 843.2586 859.7616 919.1117 936.0604 947.1640 966.6315 973.0389 984.6560 988.1709 989.4899 994.5088 998.8000 1016.1570 1020.8036 1032.7928 1056.3868 1077.8702 1084.5613 1115.1633 1149.3087 1172.3660 1173.0162 1173.4357 1178.9123 1191.3363 1221.0294 1249.4110 1259.3918 1308.1463 1318.9206 1338.0286 1375.5193 1378.9602 1386.0679 1422.8355 1429.9372 1438.6377 1442.6785 1453.1023 1464.2063 1477.6795 1479.0692 1579.1012 1596.0768 1603.9891 1607.3022 1642.1286 3009.5828 3014.4338 3076.5896 3114.2928 3125.9616 3129.0961 3136.0033 3136.7216 3147.8803 3149.1250 3154.6784 3156.0215 3162.7510 3168.1359 3174.1843
redmass: 4.2107 7.1028 7.0823 4.3317 4.1445 4.4091 5.4969 1.0927 5.3546 5.0226 4.8323 5.0210 5.9262 5.6839 4.7795 3.8326 3.2071 6.8663 2.8363 2.8846 6.0218 3.8962 3.6792 3.8244 5.6867 6.0600 5.5074 6.0409 6.1056 5.8054 3.9045 2.0059 1.8476 2.4855 1.9157 4.3051 3.2218 1.2491 1.2506 1.4163 1.4088 3.7430 5.8122 1.3867 1.6389 3.8487 4.8129 1.3868 1.3553 3.0571 2.9043 2.4390 2.7274 1.5395 1.6666 1.2641 1.4430 1.0698 1.0582 2.4634 1.1743 1.1216 2.8879 4.7626 2.3347 1.3511 1.3607 1.2865 6.7641 6.8699 3.7694 1.1835 2.0267 2.1449 1.1947 1.0499 1.0525 2.2935 2.3592 5.8057 6.5288 5.9557 6.2154 9.6774 1.0292 1.0594 1.1008 1.1049 1.0850 1.0850 1.0881 1.0887 1.0928 1.0938 1.1053 1.0964 1.0972 1.1012 1.0998
irintensity: 0.4074 1.3485 1.0183 0.6694 0.4300 0.4367 0.9860 0.1070 1.0763 3.7146 7.5117 1.7790 0.8768 0.8818 4.3709 9.9008 3.3656 5.1213 0.1567 0.3611 2.9214 6.1847 4.6996 8.3809 1.8323 9.3969 15.6254 5.9889 5.8818 6.3839 5.3197 65.8346 46.1642 26.6575 35.3654 10.2605 28.7463 0.1036 4.1699 1.8018 9.1173 35.2493 69.1448 0.0966 3.0850 0.9645 2.0095 0.0576 2.1786 18.2583 5.7780 16.2910 10.2285 13.2852 6.3384 0.1171 16.5882 2.3289 0.3252 102.4897 15.2694 5.0109 106.7898 122.1671 61.9502 1.1321 5.3514 5.8734 2.0648 31.7670 122.6598 18.6318 8.2368 8.9938 24.6462 13.4097 9.6362 3.5366 42.8038 1.2814 3.8417 2.3338 11.1599 226.0982 28.4033 18.3385 2.6251 18.6976 1.5738 1.7780 9.1414 4.4619 8.2419 24.9395 11.5296 16.8921 27.3494 26.7284 6.6785
temp: 298.150 k
press: 1.00000 atm
elementType: 16 8 8 7 6 6 6 6 6 6 6 6 6 6 6 6 6 6 6 6 1 1 1 1 1 1 1 1 1 1 1 1 1 1 1
symmnumber: 1
zpe: 709612.9 jmol-1
zpe.correction: 0.270277 hartree
zpe.thermalcorrener: 0.288106 hartree
zpe.thermalcorrenthalpy: 0.289050 hartree
zpe.thermalcorrgfe: 0.222493 hartree
zpe.sumelectzpe: -1220.529715 hartree
zpe.sumelectthermal: -1220.511887 hartree
zpe.sumelectthermalent: -1220.510942 hartree
zpe.sumelectthermalfe: -1220.577500 hartree
dipole: 0.2462 3.2207 -0.0307
dipole: 3.2302
quadrupole: -104.4935 -130.4353 -120.1910
quadrupole: -4.6340 -5.1284 -18.4225
quadrupole: 13.8797 -12.0621 -1.8177 -4.6340 -5.1284 -18.4225
hfenergy: -1220.7999922 hartree
pointgroup: C01 [X(C16H15N1O2S1)]
dipole: -0.0739067 -1.2380628 0.2771562 debye
polarizability: 269.7784991|-10.096832|190.1187647|3.9940722|-0.0058366|148.905405 unknown
InChI: InChI=1S/C16H15NO2S/c1-19-15(18)12-17(14-10-6-3-7-11-14)16(20)13-8-4-2-5-9-13/h2-11H,12H2,1H3
charge 0 multiplicity 1
35 atoms
S  0.171594 2.58192 -1.377685
O  -0.380544 -2.26343 -0.117534
O  -0.775513 -2.638377 2.146138
N  -0.355528 0.510315 0.314676
C  -1.779429 0.739553 0.09665
C  -0.034483 -0.408449 1.424613
C  0.592342 1.250158 -0.382066
C  2.030137 0.84152 -0.265312
C  -2.537681 1.439323 1.061606
C  -2.39664 0.219416 -1.063285
C  2.439672 -0.496823 -0.524818
C  3.018049 1.821812 0.019243
C  -0.447597 -1.870829 1.215829
C  -3.924857 1.619761 0.863162
C  -3.781233 0.407203 -1.258637
C  -4.548848 1.105372 -0.296215
C  3.809413 -0.840066 -0.497773
C  4.382199 1.468595 0.070435
C  4.784455 0.136395 -0.190364
C  -0.77425 -3.671047 -0.388569
H  1.05097 -0.383931 1.620999
H  -0.547473 -0.081202 2.346905
H  -2.045244 1.861437 1.944974
H  -1.787583 -0.315123 -1.798157
H  1.687486 -1.251135 -0.780652
H  2.699651 2.856661 0.181552
H  -4.512739 2.168568 1.606803
H  -4.260964 0.010901 -2.160243
H  -5.623687 1.250123 -0.45081
H  4.114415 -1.868491 -0.721906
H  5.132564 2.232699 0.301285
H  5.84606 -0.133508 -0.164169
H  -0.643683 -3.794427 -1.472325
H  -1.823953 -3.829526 -0.091619
H  -0.126879 -4.362366 0.175969
