program: Gaussian 09
title: 000291997
version: EM64L-G09RevD.01
frameworkgroup: C1[X(C11H10N2O)]
method: RPBEPBE
basis: SDD
operation: Freq
keyword: #p
keyword: freq=noraman
keyword: PBEPBE/SDD
title: #p freq=noraman PBEPBE/SDD
converged: NO YES NO NO
title: Mulliken charges:
elementType: O N N C C C C C C C C C C C H H H H H H H H H H
charge: -0.242153 -0.266995 -0.023696 0.469364 0.202347 0.214443 -0.275413 -0.372598 -0.331672 -0.424533 -0.215075 -0.215972 -0.237551 -0.753826 0.266887 0.254474 0.275298 0.258254 0.232672 0.233848 0.246792 0.245852 0.224914 0.234338
chargesum: 0.00000
title: Mulliken charges with hydrogens summed into heavy atoms:
elementType: O N N C C C C C C C C C C C
charge: -0.242153 -0.266995 -0.023696 0.469364 0.202347 0.214443 -0.008526 -0.118124 -0.056374 -0.166279 0.017597 0.017876 -0.003212 -0.036268
polarizability: 2.06765445e+02 5.18323796e+00 1.27175319e+02 -1.13827399e-01 5.78109253e+00 7.27270485e+01
1716.lowfreq: -5.9288 0.0005 0.0006 0.0007 2.2856 7.6807 51.4370 66.0459 99.5483
frequency: 51.4358 66.0374 99.5475 122.2779 173.0110 183.9068 265.8924 280.3702 322.2280 383.0263 406.7914 433.9680 503.7352 521.1669 549.4781 589.1721 612.0474 620.4441 694.3353 698.6669 729.6818 744.1485 769.8004 840.4479 867.4985 893.1639 911.0943 923.0375 963.1490 970.9324 988.9721 995.6994 1012.4420 1029.6499 1049.8918 1085.0167 1138.4509 1175.0732 1188.3132 1205.4407 1211.5421 1270.1510 1320.5983 1324.3158 1384.6535 1393.8632 1404.0279 1442.4112 1450.7246 1459.6731 1480.8842 1518.3136 1562.4995 1596.1217 1609.9622 1647.9347 2991.0450 3073.3330 3112.2022 3131.6435 3139.7891 3145.6814 3153.1288 3168.1901 3178.5811 3191.8934
redmass: 4.4558 4.0651 4.6192 1.1325 4.9723 3.6490 6.7783 3.8192 3.8332 4.2536 2.9135 3.1305 3.9285 6.4039 5.6016 5.6370 6.1119 4.3747 2.9835 2.7871 4.0639 5.6075 1.8944 1.2483 1.4637 2.9536 1.4985 1.4547 6.5367 1.3838 4.9185 1.3956 1.5549 2.0261 1.5980 1.6030 7.3449 1.0509 1.1511 4.0997 1.6819 4.1605 1.5769 1.4559 9.6039 1.3015 1.8624 2.2987 1.0460 1.1185 2.3189 6.3285 6.5679 6.4911 6.1879 8.8615 1.0369 1.0968 1.1003 1.0858 1.0895 1.0922 1.0943 1.0997 1.0928 1.0964
irintensity: 1.9496 0.3053 1.7071 0.0828 4.7179 0.3401 2.1373 0.6539 1.4351 5.4261 0.2151 9.9257 1.9757 5.6663 0.9449 14.5315 0.5149 2.2074 30.2303 18.0605 9.1173 9.1632 55.4534 0.8886 27.6070 3.5849 3.2884 1.2020 10.4895 0.3019 1.3223 0.3229 12.9237 8.5596 13.3550 6.8738 45.9023 0.0917 3.6006 22.0319 23.2812 64.2586 26.0213 12.7761 6.1914 4.4698 86.0778 12.0784 14.9151 21.2651 64.8205 199.8726 33.9196 4.4801 1.7877 429.8465 10.1199 10.7781 19.5990 2.8431 8.0212 3.5647 22.5312 22.9076 2.8616 1.2754
temp: 298.150 k
press: 1.00000 atm
elementType: 8 7 7 6 6 6 6 6 6 6 6 6 6 6 1 1 1 1 1 1 1 1 1 1
symmnumber: 1
zpe: 487015.3 jmol-1
zpe.correction: 0.185494 hartree
zpe.thermalcorrener: 0.197147 hartree
zpe.thermalcorrenthalpy: 0.198091 hartree
zpe.thermalcorrgfe: 0.147254 hartree
zpe.sumelectzpe: -608.919948 hartree
zpe.sumelectthermal: -608.908295 hartree
zpe.sumelectthermalent: -608.907351 hartree
zpe.sumelectthermalfe: -608.958188 hartree
dipole: 0.7242 -2.0864 0.6092
dipole: 2.2911
quadrupole: -63.6757 -87.0693 -83.1212
quadrupole: -4.7550 2.0989 6.9300
quadrupole: 14.2797 -9.1139 -5.1658 -4.7550 2.0989 6.9300
hfenergy: -609.1054425 hartree
pointgroup: C01 [X(C11H10N2O1)]
dipole: 0.2894411 -0.8154863 0.2523357 debye
dipolederiv: -0.6345141 -0.3541042 0.1360819 -0.2045144 -0.9881259 0.2170954 0.0381399 0.2116952 -0.4051361 -0.9231877 0.2005837 -0.0801654 -0.4781306 -0.6830331 0.1729159 0.1594719 0.1799175 -0.1279584 -1.3881145 0.1973064 -0.0890879 0.0986184 -0.4666214 0.0834766 -0.1409445 0.0868803 -0.2871639 0.868525 -0.0991593 0.0055058 0.0676766 0.0098798 0.0934286 -0.0169998 0.0546864 0.0741268 0.8569247 0.4155537 -0.1335741 0.0446525 1.3066133 -0.3759421 -0.0310235 -0.3155409 0.3166712 1.068409 0.0068623 0.0321778 -0.1088772 0.5503094 -0.1757688 0.0910336 -0.1677066 0.0979524 1.085115 0.0447685 0.0172504 0.7463431 0.2978857 -0.1331874 -0.1051834 -0.1131087 0.0792504 -0.1022141 0.0641288 0.0340601 0.0020042 -0.0685237 0.0510982 0.0250052 0.0600794 -0.0971366 -0.1484876 -0.0770938 -0.0287675 -0.0954536 0.0092185 0.0492553 0.0103576 -0.0094577 -0.0809264 -0.5497948 -0.4626185 0.1531182 -0.1646515 -0.303232 0.0443616 0.0487871 0.0066755 -0.1898024 -0.059402 -0.0729196 -0.032962 -0.0813586 0.0315109 0.105157 -0.06876 0.1030843 -0.0881877 0.0057873 0.1104622 0.0549411 0.0818823 0.0413338 0.1010499 0.0607786 0.0844709 -0.091068 0.0783834 -0.0076503 -0.0056832 0.0146609 -0.0755497 0.0372013 0.0175269 0.0439133 -0.1319566 -0.3396364 -0.065286 0.0097228 -0.2107058 0.029564 -0.0054261 0.0625768 0.0014481 0.0281952 0.0269453 0.0802817 -0.0365329 0.0898659 0.039039 0.0351212 -0.0429962 0.0226063 0.1072288 0.0270687 -0.0819991 -0.0500966 -0.0758951 0.0460421 -0.0759508 -0.0607528 -0.0612315 0.1041734 0.0990111 0.0569626 0.0325355 0.0569849 0.0518813 -0.0635348 0.0434914 -0.0285262 0.1142335 0.0201278 0.0469145 -0.0180022 0.0781313 0.0194336 0.0495671 -0.04694 0.040969 0.1490464 0.023676 0.0649765 0.0348127 0.0861155 -0.0109783 -0.0986208 0.0434639 -0.0971914 0.1011826 0.0085825 -0.066157 -0.0443269 -0.0876202 0.0015483 -0.0906995 -0.0517411 -0.0846431 0.1047002 0.0396304 -0.019824 0.0330819 0.0099344 0.1151124 0.0549782 0.0764843 0.051796 -0.0633053 0.0513185 -0.0238941 -0.010462 -0.0253037 0.0018809 -0.1070355 -0.0631556 -0.1036066 0.0451934 0.0152043 0.031855 -0.0149522 0.1435757 -0.0636237 0.0640193 -0.0488449 0.0590606 0.0942534 -0.1293579 0.0100501 0.0013247 0.0120651 0.1084345 -0.03256 0.0002246 -0.0262699 0.1464335 unknown
polarizability: 206.7162021|5.534117|127.4005683|-0.8015861|4.8295809|72.551042 unknown
InChI: InChI=1S/C11H10N2O/c1-9-7-11(14)13(8-12-9)10-5-3-2-4-6-10/h2-8H,1H3
charge 0 multiplicity 1
24 atoms
O  -0.424686 2.214854 -0.604591
N  -0.306371 -0.06243 0.084487
N  -2.32004 -1.341962 0.472549
C  1.143935 -0.091257 0.04715
C  -1.038125 1.152971 -0.298107
C  -3.082786 -0.228678 0.075708
C  -1.001707 -1.207599 0.4585
C  1.794196 -1.180167 -0.582824
C  1.897637 0.944983 0.646972
C  -2.481902 0.969197 -0.286175
C  3.204514 -1.243986 -0.591229
C  3.306692 0.876408 0.623437
C  3.96474 -0.216173 0.011653
C  -4.57502 -0.439875 0.08463
H  -0.383019 -2.04935 0.787106
H  1.204022 -1.955053 -1.085035
H  1.387891 1.792427 1.109847
H  -3.075886 1.83674 -0.584565
H  3.704958 -2.086791 -1.079861
H  3.890697 1.679552 1.085301
H  -4.908831 -0.727292 1.098198
H  -4.840425 -1.277573 -0.585812
H  -5.119985 0.46325 -0.233143
H  5.059002 -0.261696 -0.001796
