program: Gaussian 09
title: 000292003
version: EM64L-G09RevD.01
frameworkgroup: C1[X(C8H9ClN2O4S)]
method: RPBEPBE
basis: SDD
operation: Freq
keyword: #p
keyword: freq=noraman
keyword: PBEPBE/SDD
title: #p freq=noraman PBEPBE/SDD
converged: YES YES NO NO
title: Mulliken charges:
elementType: Cl S O O O O N N C C C C C C C C H H H H H H H H H
charge: -0.214867 0.902824 -0.461383 -0.455184 -0.191123 -0.209823 -0.122130 0.005680 0.367652 0.262800 -0.145843 -0.295599 -0.324569 -0.221434 -0.654026 -0.663075 0.262672 0.331040 0.289321 0.254339 0.236073 0.289069 0.256182 0.257108 0.244294
chargesum: 0.00000
title: Mulliken charges with hydrogens summed into heavy atoms:
elementType: Cl S O O O O N N C C C C C C C C
charge: -0.214867 0.902824 -0.461383 -0.455184 -0.191123 -0.209823 -0.122130 0.005680 0.367652 0.262800 -0.145843 -0.032927 0.006472 0.067887 0.125455 0.094510
polarizability: 2.84852365e+02 -9.07995289e+00 1.63825704e+02 -2.29223076e+00 -2.34046377e+00 1.15202396e+02
1716.lowfreq: -7.0363 -3.6174 -0.0016 0.0014 0.0020 7.4969 26.3898 42.8837 67.2468
frequency: 25.7885 42.8805 67.2434 89.5414 99.2097 108.7095 145.8149 176.3657 185.5686 197.0310 216.3647 235.9903 240.3484 247.8176 254.0438 311.8575 344.9257 368.1919 378.5258 399.6770 427.1952 451.8555 469.6305 543.2432 562.4818 609.1990 635.0235 683.9917 720.9307 739.6762 807.7366 811.5752 825.8406 928.2278 940.9296 959.9940 965.8619 1054.0885 1059.9071 1067.9437 1088.2354 1120.4535 1152.9699 1168.2016 1193.4192 1221.5613 1264.9187 1346.2715 1368.1319 1376.0725 1428.6450 1433.5602 1442.6055 1466.6741 1473.7198 1482.4611 1490.8429 1521.9662 1552.0034 1603.2807 2966.7234 2984.3388 3069.1027 3075.2000 3097.4369 3111.6381 3162.7463 3165.0809 3188.6576
redmass: 12.4664 7.4909 6.3936 4.0189 9.1659 4.3297 4.8871 8.3592 1.4130 7.1219 5.0443 4.7619 8.1434 1.2864 4.8109 5.3949 5.1580 4.8530 6.5566 8.2766 7.5920 4.1620 3.7610 3.9283 4.3989 6.3118 7.3008 8.7176 6.5134 3.7233 7.4272 1.7506 12.5038 1.4188 3.5259 11.0688 1.4223 2.6112 1.7292 3.1822 1.2329 1.4015 1.6626 1.7772 5.5163 2.0290 1.6452 7.4100 2.4404 4.9657 2.9315 1.2759 1.3635 1.1036 1.1232 1.0966 1.0854 2.4308 7.9680 6.3539 1.0418 1.0341 1.0926 1.1012 1.1016 1.1013 1.0899 1.0925 1.0948
irintensity: 1.1927 0.0889 1.2527 0.5615 2.6676 2.2165 4.8664 0.5760 0.9844 1.5948 5.2537 3.8111 9.0882 2.3734 3.0894 11.0698 16.9801 21.5506 14.0931 30.2654 88.7009 68.5342 11.2810 26.8729 12.0911 10.0211 12.5821 5.3424 2.1140 4.4100 30.2012 30.6996 103.7874 12.3139 31.4264 42.0170 5.8221 13.6557 15.4641 84.1007 8.6556 0.9735 33.0906 26.9760 308.8318 12.6593 15.8230 75.1246 16.8289 23.0217 11.1857 14.5780 22.6333 24.4235 25.6881 11.7036 9.1505 82.8021 38.7697 289.8236 57.5532 44.8969 19.9645 12.8554 8.9247 9.8734 3.9341 16.3127 4.7666
temp: 298.150 k
press: 1.00000 atm
elementType: 17 16 8 8 8 8 7 7 6 6 6 6 6 6 6 6 1 1 1 1 1 1 1 1 1
symmnumber: 1
zpe: 445119.4 jmol-1
zpe.correction: 0.169537 hartree
zpe.thermalcorrener: 0.186270 hartree
zpe.thermalcorrenthalpy: 0.187214 hartree
zpe.thermalcorrgfe: 0.123913 hartree
zpe.sumelectzpe: -1577.316357 hartree
zpe.sumelectthermal: -1577.299624 hartree
zpe.sumelectthermalent: -1577.298680 hartree
zpe.sumelectthermalfe: -1577.361980 hartree
dipole: 8.9452 -6.2279 -0.6692
dipole: 10.9202
quadrupole: -112.4185 -110.8697 -114.3738
quadrupole: -16.1210 -5.6934 -2.2426
quadrupole: 0.1355 1.6843 -1.8198 -16.1210 -5.6934 -2.2426
hfenergy: -1577.4858935 hartree
pointgroup: C01 [X(C8H9Cl1N2O4S1)]
dipole: -3.421943 2.5903576 0.197155 debye
dipolederiv: -0.5416442 0.0565142 -0.0922726 0.2532972 -0.3257155 0.1877976 -0.5994902 0.2427203 -0.7373017 2.3051973 -0.1474089 0.1908028 -0.2981773 1.0130031 -0.2785859 0.2116036 -0.2656366 1.54779 -0.6919841 -0.0134826 -0.0063657 -0.1768285 -0.5177928 0.1219506 0.0229947 0.0314066 -0.429617 -0.624633 0.0329261 -0.0278616 0.1721268 -0.4171895 -0.0887593 0.1723367 -0.0387839 -0.5280038 -0.2991916 0.0517475 0.1302485 -0.1264586 -0.7631589 -0.3188664 0.0661608 -0.2982113 -0.4678942 -0.7064282 -0.3258423 0.1422327 -0.2596914 -0.4397615 -0.046909 0.1762809 0.0113761 -0.4021481 -1.3637923 0.3550512 -0.0584364 0.1627628 -0.377471 0.0072502 0.0479954 -0.1739777 -0.2875936 0.796688 0.5371255 -0.2894125 0.6608727 1.399554 0.4991388 -0.1553203 0.4095669 0.6834982 1.433321 -0.4575227 0.076348 -0.2647936 0.1599682 -0.1113564 0.1037398 0.0041207 0.0735693 -0.5932772 -0.3690417 -0.1199156 0.1673686 -0.4882461 -0.0922734 0.1902257 -0.1851473 -0.087325 -0.7543058 -0.0789676 -0.0787565 -0.222532 -0.4192308 -0.0899384 0.4517166 -0.1353956 -0.1819924 -0.6653411 0.1768493 -0.0316305 -0.1869152 0.0531425 0.0777374 -0.2752251 0.1822815 -0.1388528 0.55964 0.3154129 0.1455187 0.3778757 0.0021444 0.0487851 -0.0982209 -0.057341 -0.0479116 0.2621768 -0.173182 -0.0391192 -0.3407608 0.2673126 0.0901181 -0.3140105 0.1327823 -0.0459416 0.2848315 0.1182512 0.1420502 0.2754921 0.1822987 0.0243146 0.3245773 -0.0502031 0.229653 0.2020784 -0.0996395 -0.078116 -0.3307071 0.4890959 0.0442087 -0.3036199 0.1308019 0.188217 0.0358922 0.0682695 0.0169851 0.0381243 0.0006254 -0.0644001 0.0228082 -0.04978 0.1437582 0.1507734 0.0059152 0.0101464 0.0238459 0.1316014 0.0048013 -0.0164515 -0.0032328 0.1421186 0.0904787 -0.0645518 -0.0190102 -0.0188341 0.1099221 -0.0202997 0.0249552 -0.0265503 0.1307763 0.0356853 0.0418227 0.1151935 -0.00279 0.0349569 -0.089947 0.0069172 -0.0246001 -0.0054858 -0.0205629 0.0588601 -0.0722039 0.1316894 -0.0339389 0.0663692 -0.140395 0.0681689 0.0876686 0.0479136 -0.0303569 -0.0055121 -0.1614988 -0.0112807 0.0041355 -0.0056223 0.0842844 0.0487339 0.0909607 -0.0188178 -0.1227506 0.0407516 0.0398074 -0.0087668 -0.0030465 -0.0441818 -0.0593269 -0.1193457 0.0212363 0.0399448 -0.0385502 0.0729781 -0.0005483 0.022346 -0.0203973 0.1295097 0.0848691 -0.0611679 0.0318928 0.1243302 -0.1626251 0.0340435 0.0667442 0.0759292 0.0141016 unknown
polarizability: 281.9503641|-17.5539632|158.866004|15.7960849|14.8858276|123.0640972 unknown
InChI: InChI=1S/C8H9N2O4S.Cl/c1-9(2)7-4-3-6(15(13)14)5-8(7)10(11)12;/h3-5H,1-2H3;
charge 0 multiplicity 1
25 atoms
Cl 3.808009 -0.861732 2.043549
S  3.293207 0.005146 -0.173035
O  4.009085 1.455185 -0.268121
O  3.591507 -1.174947 -1.239389
O  -1.163519 -2.680348 -1.346324
O  -2.658689 -1.939099 0.214124
N  -2.671979 1.016748 0.077173
N  -1.596016 -1.790003 -0.514067
C  -1.335102 0.681451 0.150459
C  -0.782104 -0.574785 -0.310271
C  1.462719 0.251442 -0.021596
C  -0.386158 1.65164 0.639749
C  0.609864 -0.772875 -0.432503
C  0.991394 1.448381 0.564582
C  -3.617404 0.391393 -0.866093
C  -3.200196 2.163057 0.844905
H  -0.748781 2.605616 1.027806
H  0.984756 -1.726703 -0.817327
H  1.693881 2.216542 0.901946
H  -3.078445 -0.044922 -1.723275
H  -4.293591 1.174482 -1.25176
H  -4.208965 -0.409759 -0.387812
H  -2.763396 2.194566 1.856616
H  -4.288852 2.037866 0.955801
H  -3.010925 3.129755 0.336061
