program: Gaussian 09
title: 000292116
version: EM64L-G09RevD.01
frameworkgroup: C1[X(C15H20N4O8)]
method: RPBEPBE
basis: SDD
operation: Freq
keyword: #p
keyword: freq=noraman
keyword: PBEPBE/SDD
title: #p freq=noraman PBEPBE/SDD
converged: YES YES NO NO
title: Mulliken charges:
elementType: O O O O O O O O N N N N C C C C C C C C C C C C C C C H H H H H H H H H H H H H H H H H H H H
charge: -0.277459 -0.274836 -0.280627 -0.244991 -0.230223 -0.242024 -0.276433 -0.337122 -0.183859 -0.102424 -0.637796 -0.623277 -0.154145 -0.110830 -0.154801 -0.024815 -0.358172 0.311012 -0.220639 -0.104474 0.315875 0.310968 0.323971 -0.777114 -0.759317 0.192078 -0.761475 0.304064 0.329997 0.302429 0.267531 0.245785 0.262212 0.265169 0.369581 0.337850 0.245424 0.246617 0.292760 0.262800 0.250894 0.257627 0.245984 0.241098 0.288833 0.324150 0.342144
chargesum: 0.00000
title: Mulliken charges with hydrogens summed into heavy atoms:
elementType: O O O O O O O O N N N N C C C C C C C C C C C C C C C
charge: -0.277459 -0.274836 -0.280627 -0.244991 -0.230223 -0.242024 -0.276433 -0.337122 -0.183859 -0.102424 0.069635 0.043018 0.149919 0.219167 0.147628 0.242716 0.149824 0.311012 0.044529 -0.104474 0.315875 0.310968 0.323971 0.007687 0.012004 0.192078 0.014440
polarizability: 2.78285959e+02 1.31557033e+01 1.87439265e+02 5.10527161e+00 -2.00888128e+01 1.84127243e+02
1716.lowfreq: -8.3010 -2.2758 -0.0005 0.0003 0.0006 4.2166 17.0612 30.0145 38.9239
frequency: 16.8350 29.9399 38.9119 44.4746 56.3693 62.8154 67.9046 73.9824 80.5868 84.2127 88.1586 89.6099 100.7871 121.3753 126.5690 135.4225 141.9428 150.4036 170.7278 197.4529 204.5557 207.2858 221.3507 250.9450 283.0282 292.7597 297.5197 313.5316 330.7916 366.9020 390.9404 414.2156 428.2306 468.1666 475.0552 490.0858 515.1746 515.8483 554.5441 562.3956 567.1267 572.8474 608.1851 612.3100 617.9177 626.8641 639.5937 648.0678 665.5992 707.6848 717.0475 722.1659 734.0347 764.1885 773.7839 779.4577 783.4241 824.5427 851.0803 857.4392 867.2752 930.6829 950.4968 955.4533 973.7643 987.1281 997.1355 1001.6542 1006.3492 1018.8367 1045.5085 1050.0929 1050.1577 1051.3883 1055.6441 1104.3807 1106.0356 1137.2280 1154.0759 1177.6264 1186.5831 1188.1088 1203.1792 1205.7752 1221.5680 1233.5864 1265.5173 1275.3274 1284.1891 1293.8502 1313.0678 1326.3508 1350.7205 1355.7936 1375.6751 1385.6331 1386.9994 1389.4308 1416.6215 1441.4537 1451.5467 1452.5862 1453.4279 1456.5616 1458.7981 1459.5898 1460.6590 1478.4058 1550.3529 1580.7836 1616.5475 1641.3178 1643.9288 1655.1879 1668.7353 3003.5484 3005.6158 3006.9223 3044.0136 3044.9101 3052.3241 3089.0816 3094.0595 3100.5700 3100.5958 3101.2693 3129.8817 3142.3936 3142.6981 3143.6882 3257.5683 3409.8371 3515.3410 3612.7063 3681.9751
redmass: 6.7092 5.5911 6.5908 6.8651 6.6367 7.4305 4.2287 5.0643 5.6119 1.0607 5.5657 4.1658 3.9249 6.8674 4.0626 1.1134 1.0588 5.6525 5.6333 4.7906 5.8209 9.3513 6.6476 5.2943 4.9899 5.0150 4.2586 3.4353 3.7243 3.9343 3.5023 4.3720 5.1185 4.9992 1.2581 3.2066 1.8439 1.9175 3.8687 3.4157 3.2995 3.4113 1.1942 5.5695 3.9979 2.6849 5.3218 5.6554 5.6366 1.7240 5.2092 1.2821 4.2740 7.3959 5.7196 5.1423 4.6826 5.4948 5.2628 2.8071 5.1622 4.6541 4.0129 4.0562 3.7069 2.9269 2.0006 3.3022 2.3186 3.3609 1.6594 1.7164 1.9012 1.6514 2.1234 2.1178 1.9897 2.8575 2.1708 3.0399 3.1485 2.4570 1.7057 3.5628 1.2264 2.5275 1.8548 1.7910 1.3486 1.5473 1.2428 1.4956 1.3223 1.4952 1.4669 1.2431 1.2508 1.2580 4.7318 4.4743 1.0553 1.0554 1.0556 1.0560 1.0682 1.0591 1.0737 4.1832 2.4039 1.3525 1.9956 8.6473 5.0708 9.9751 10.3625 1.0386 1.0381 1.0387 1.0816 1.0840 1.0644 1.0854 1.0877 1.0936 1.0937 1.0942 1.1087 1.1026 1.1025 1.1024 1.0983 1.0521 1.0447 1.0968 1.1045
irintensity: 0.5107 0.6053 0.6128 0.2383 0.6455 1.0069 4.0697 2.2046 7.8516 0.4070 1.1893 0.5261 3.9707 7.8212 1.1836 0.6844 0.4501 3.8345 2.4363 13.0169 11.3330 5.7070 4.3978 14.1208 16.7321 3.0590 4.7277 1.1599 3.5286 28.7908 4.6959 2.7232 3.0857 1.5312 107.3074 48.9625 119.7679 84.7735 6.4733 2.5831 1.6708 4.6310 73.2910 14.4126 8.4006 4.7245 2.7304 25.7336 21.8387 49.0223 22.1516 155.3019 58.8054 28.2035 29.8059 30.9109 12.6188 22.1563 30.8206 53.8961 76.2149 99.3230 25.7870 33.6888 22.9921 15.3561 69.0948 189.6746 91.2892 34.0424 12.0815 17.5973 24.4991 30.7977 40.3480 5.0504 5.5947 18.7713 6.8775 262.9536 95.5992 73.3258 26.1216 510.2982 15.9530 85.6790 39.9912 2.0421 13.1425 49.8838 4.0284 21.5249 0.8027 22.3149 3.0176 77.9997 96.6569 24.8000 22.5049 2.1484 15.4866 13.3280 21.0477 12.4005 32.1914 32.5524 3.0596 115.0245 363.3018 205.0899 79.5314 168.6236 398.9083 228.4016 137.4163 4.5338 3.5612 0.5166 15.4771 2.1384 22.0068 7.3933 7.6365 6.7820 1.5232 4.7794 5.1760 5.7338 6.1785 7.9723 0.2741 93.8219 52.7255 90.0712 53.1174
temp: 298.150 k
press: 1.00000 atm
elementType: 8 8 8 8 8 8 8 8 7 7 7 7 6 6 6 6 6 6 6 6 6 6 6 6 6 6 6 1 1 1 1 1 1 1 1 1 1 1 1 1 1 1 1 1 1 1 1
symmnumber: 1
zpe: 938846.9 jmol-1
zpe.correction: 0.357588 hartree
zpe.thermalcorrener: 0.385686 hartree
zpe.thermalcorrenthalpy: 0.386630 hartree
zpe.thermalcorrgfe: 0.296667 hartree
zpe.sumelectzpe: -1402.395148 hartree
zpe.sumelectthermal: -1402.367050 hartree
zpe.sumelectthermalent: -1402.366106 hartree
zpe.sumelectthermalfe: -1402.456069 hartree
dipole: -3.9704 1.0825 0.2730
dipole: 4.1244
quadrupole: -172.7989 -141.4479 -159.7111
quadrupole: 9.6702 -15.1737 -4.1089
quadrupole: -14.8129 16.5381 -1.7251 9.6702 -15.1737 -4.1089
hfenergy: -1402.7527362 hartree
pointgroup: C01 [X(C15H20N4O8)]
dipole: 1.6088373 0.1969347 0.0769079 debye
polarizability: 253.0320155|36.6743108|185.0648398|30.6012434|-1.9066791|211.7556123 unknown
InChI: InChI=1S/C15H20N4O8/c1-6(20)24-4-9-11(25-7(2)21)12(26-8(3)22)15(27-9)19-5-18-10(13(19)16)14(17)23/h5,9,11-12,15H,4,16-17H2,1-3H3
charge 0 multiplicity 1
47 atoms
O  -0.162052 -1.053789 1.062948
O  0.458597 1.774403 1.899547
O  0.971485 0.560152 -1.551134
O  3.572275 -1.140702 1.138762
O  1.281987 3.685419 0.843813
O  3.267922 0.373755 -1.916259
O  3.925521 1.066395 1.814768
O  -5.322571 -2.629487 -0.723463
N  -1.958069 -0.054281 -0.215096
N  -3.292265 0.186834 -2.044357
N  -3.079024 -1.916727 0.938148
N  -5.608887 -1.404585 -2.704262
C  0.028198 1.286697 0.568111
C  1.231532 0.575418 -0.09023
C  -0.981781 0.164538 0.85233
C  1.205294 -0.857551 0.493879
C  2.183315 -1.090302 1.661336
C  -2.957299 -1.034698 -0.108497
C  -2.207374 0.654132 -1.424532
C  -3.779032 -0.868749 -1.239505
C  1.170627 3.006909 1.884246
C  2.110959 0.470222 -2.378311
C  4.337965 0.033201 1.235715
C  1.760431 3.286965 3.23856
C  1.712504 0.534069 -3.831974
C  -4.949769 -1.695191 -1.526974
C  5.653108 -0.135439 0.522547
H  -0.341337 2.126495 -0.040695
H  2.176857 1.105744 0.099092
H  -1.51496 0.324712 1.806152
H  1.36886 -1.606312 -0.30092
H  2.001686 -2.08135 2.103479
H  2.085278 -0.299196 2.422957
H  -1.552344 1.437541 -1.791206
H  -3.891022 -2.541267 0.842314
H  -2.252517 -2.2118 1.457566
H  1.113865 2.906558 4.044393
H  1.93632 4.366239 3.357399
H  2.730853 2.758336 3.292841
H  0.726492 0.070962 -3.991422
H  2.477902 0.040593 -4.44933
H  1.64502 1.592323 -4.144995
H  6.05066 -1.153541 0.656664
H  6.374586 0.614492 0.878279
H  5.471698 0.020262 -0.557216
H  -6.435426 -1.93897 -2.961926
H  -5.260869 -0.647826 -3.29374
