program: Gaussian 09
title: 000292016
version: EM64L-G09RevD.01
frameworkgroup: C1[X(C13H12N2O4S)]
method: RPBEPBE
basis: SDD
operation: Freq
keyword: #p
keyword: freq=noraman
keyword: PBEPBE/SDD
title: #p freq=noraman PBEPBE/SDD
converged: YES YES NO NO
title: Mulliken charges:
elementType: S O O O O N N C C C C C C C C C C C C C H H H H H H H H H H H H
charge: 0.946926 -0.524434 -0.506009 -0.197272 -0.187257 -0.286809 0.024906 -0.066733 0.329646 -0.677926 -0.323146 -0.253062 0.392887 -0.324763 -0.323823 -0.176991 -0.351689 -0.226733 -0.214057 -0.230964 0.334608 0.206772 0.263815 0.285621 0.297518 0.235672 0.295670 0.254020 0.295006 0.231275 0.239724 0.237603
chargesum: 0.00000
title: Mulliken charges with hydrogens summed into heavy atoms:
elementType: S O O O O N N C C C C C C C C C C C C C
charge: 0.946926 -0.524434 -0.506009 -0.197272 -0.187257 -0.286809 0.024906 -0.066733 0.329646 0.078281 0.011463 0.044455 0.392887 -0.089092 -0.028153 0.077029 -0.056682 0.004542 0.025666 0.006638
polarizability: 2.01902664e+02 -1.56325202e+01 2.41998701e+02 -9.64687915e+00 -1.34178247e+01 1.66829507e+02
1716.lowfreq: -6.7443 0.0009 0.0012 0.0014 5.1173 7.4029 14.7176 19.0437 38.1793
frequency: 13.0915 18.8255 38.1428 53.2284 72.9968 95.0886 101.5450 150.7133 152.7469 181.7206 195.1302 205.3767 210.6325 234.9076 246.9464 281.6609 323.6614 342.0824 370.6443 396.2247 407.6757 423.0006 430.6417 450.0111 508.2403 515.1011 532.6383 545.2022 609.5988 633.8247 669.4600 681.4143 690.8073 701.1016 756.7423 774.9880 795.5345 811.2301 820.7102 837.3290 918.9084 928.2002 944.0241 960.2265 976.6961 979.6700 982.4446 997.8081 1007.6081 1008.6107 1028.9136 1049.1094 1073.7691 1080.8973 1083.3668 1096.6468 1140.2068 1169.9700 1175.3610 1186.9365 1213.4001 1246.4642 1268.4728 1319.3935 1375.4684 1380.6577 1400.9387 1411.3571 1422.1708 1438.8308 1444.6142 1449.3110 1469.7270 1490.9541 1573.0788 1582.2478 1595.7506 1597.4375 2931.6453 3044.5221 3097.0753 3132.3525 3143.7877 3151.8022 3156.5689 3167.6704 3167.8823 3175.5053 3180.8538 3188.4765
redmass: 5.4199 7.0402 5.3255 8.6328 4.6098 5.1901 11.4994 4.9721 6.2873 4.2636 6.3132 7.7844 2.3432 6.9895 2.1470 2.8626 3.9812 6.4332 8.9804 9.0045 2.8739 3.9437 6.7600 4.7006 6.5403 6.8048 3.3901 5.0627 6.4147 7.2662 3.6824 8.7768 1.7587 3.6738 5.2461 1.8656 11.3311 13.3594 1.4058 1.2590 1.4605 1.4569 10.1650 1.3973 1.4724 5.8563 4.7548 1.3345 5.7005 1.3793 2.1699 2.1073 1.4115 1.8835 1.5434 2.4097 1.4364 1.1256 1.0548 1.1828 9.8873 4.0109 1.3168 1.3632 8.2552 6.6326 8.5086 1.1335 3.0331 2.2596 2.3013 1.0784 2.0113 1.0871 5.6812 6.8710 5.8257 7.6196 1.0443 1.0883 1.0987 1.0854 1.0888 1.0887 1.0932 1.0973 1.0944 1.0931 1.0981 1.0969
irintensity: 1.9603 0.3375 0.2706 1.3137 1.3559 0.7680 2.7781 2.7713 9.9044 3.0078 4.5578 3.6432 4.6641 4.6957 1.0762 2.6507 1.4436 1.6378 18.1560 1.6592 1.6794 23.3656 59.5861 13.8221 36.7620 21.0206 8.9443 5.8799 0.1982 4.9961 14.8337 12.3849 51.9301 18.7833 2.7521 54.3357 23.5850 112.7864 21.9701 0.8242 5.7098 3.6717 52.2540 3.6017 0.9097 2.2496 1.6379 0.5337 4.7586 0.5604 3.7226 17.1086 31.4364 21.7071 7.8651 15.9642 2.2303 14.2977 0.0602 3.8117 207.2611 2.4203 0.3467 1.1103 71.4454 1.7757 1.4211 17.0696 58.3490 11.9081 23.5562 30.4331 24.7262 13.2610 2.5127 5.6916 0.8846 1.9147 42.1702 13.7290 0.7366 2.6087 6.2005 3.4233 18.7083 14.7613 8.5520 11.0831 7.0008 2.6403
temp: 298.150 k
press: 1.00000 atm
elementType: 16 8 8 8 8 7 7 6 6 6 6 6 6 6 6 6 6 6 6 6 1 1 1 1 1 1 1 1 1 1 1 1
symmnumber: 1
zpe: 599857.9 jmol-1
zpe.correction: 0.228474 hartree
zpe.thermalcorrener: 0.247465 hartree
zpe.thermalcorrenthalpy: 0.248410 hartree
zpe.thermalcorrgfe: 0.178552 hartree
zpe.sumelectzpe: -1309.335396 hartree
zpe.sumelectthermal: -1309.316404 hartree
zpe.sumelectthermalent: -1309.315460 hartree
zpe.sumelectthermalfe: -1309.385318 hartree
dipole: -0.0870 0.1762 6.1534
dipole: 6.1565
quadrupole: -139.5251 -120.8255 -121.3606
quadrupole: 15.9086 2.1623 -8.8094
quadrupole: -12.2880 6.4116 5.8764 15.9086 2.1623 -8.8094
hfenergy: -1309.5638693 hartree
pointgroup: C01 [X(C13H12N2O4S1)]
dipole: 0.2079451 0.0646378 -2.4123567 debye
polarizability: 198.5793691|2.2233196|247.279382|-10.3397122|10.191001|164.8721218 unknown
InChI: InChI=1S/C13H12N2O4S/c1-14(11-6-3-2-4-7-11)20(18,19)13-9-5-8-12(10-13)15(16)17/h2-10H,1H3
charge 0 multiplicity 1
32 atoms
S  -1.14423 -1.971485 0.829073
O  -1.265782 -3.565994 0.507334
O  -1.335058 -1.367167 2.32433
O  4.134762 1.74968 0.26253
O  2.294797 2.131992 1.556718
N  -2.517063 -1.042824 -0.369664
N  2.972324 1.425996 0.718872
C  0.577211 -1.425858 0.231286
C  -2.244995 0.356259 -0.441629
C  -2.581261 -1.834127 -1.618166
C  1.099738 -0.221598 0.72248
C  1.252345 -2.259154 -0.678198
C  2.372026 0.149057 0.238889
C  -1.847049 1.019419 -1.640381
C  -2.436983 1.120973 0.749238
C  2.53181 -1.856177 -1.128501
C  3.097291 -0.644948 -0.676544
C  -1.657931 2.417274 -1.644201
C  -2.211343 2.510255 0.738727
C  -1.824063 3.166693 -0.456212
H  0.569535 0.395037 1.4540
H  -1.728291 -1.698567 -2.317856
H  -3.513396 -1.54521 -2.137215
H  -2.654789 -2.899607 -1.345176
H  0.798359 -3.204795 -0.993117
H  -1.707859 0.455678 -2.568398
H  -2.763581 0.60764 1.65809
H  3.087287 -2.490391 -1.825883
H  4.082964 -0.3095 -1.009493
H  -1.372385 2.921802 -2.573976
H  -2.352323 3.0865 1.659198
H  -1.662168 4.249746 -0.461957
