program: Gaussian 09
title: 000292028
version: EM64L-G09RevD.01
frameworkgroup: C1[X(C18H17NO5)]
method: RPBEPBE
basis: SDD
operation: Freq
keyword: #p
keyword: freq=noraman
keyword: PBEPBE/SDD
title: #p freq=noraman PBEPBE/SDD
converged: YES YES NO NO
title: Mulliken charges:
elementType: O O O O O N C C C C C C C C C C C C C C C C C C H H H H H H H H H H H H H H H H H
charge: -0.227405 -0.250502 -0.286365 -0.237132 -0.222572 -0.233012 0.471323 -0.550640 0.116404 0.271329 -0.337740 -0.359632 -0.351368 -0.361166 0.269680 -0.393504 -0.318561 0.351543 -0.230872 -0.252467 -0.250676 -0.494508 0.268719 -0.756126 0.274839 0.289483 0.273559 0.253075 0.268159 0.258293 0.259870 0.306119 0.227570 0.227459 0.230302 0.246374 0.243718 0.240355 0.260298 0.253429 0.252348
chargesum: 0.00000
title: Mulliken charges with hydrogens summed into heavy atoms:
elementType: O O O O O N C C C C C C C C C C C C C C C C C C
charge: -0.227405 -0.250502 -0.286365 -0.237132 -0.222572 -0.233012 0.471323 0.013682 0.116404 0.271329 -0.064182 -0.106557 -0.083209 -0.102874 0.269680 -0.133634 -0.012442 0.351543 -0.003302 -0.025008 -0.020373 0.235940 0.268719 0.009948
polarizability: 3.46857790e+02 -2.00064283e+01 1.70625281e+02 -7.10704162e+00 -1.04141393e+00 1.77009064e+02
1716.lowfreq: -72.3906 -5.1969 -0.0009 -0.0005 -0.0005 3.2444 5.6519 19.7283 21.1465
frequency: -72.3901 19.6705 21.1161 28.8842 34.9715 40.6738 53.6829 67.8016 70.6846 88.4229 94.9264 129.8863 141.8979 159.3297 186.7424 197.5934 217.3981 266.4111 282.1489 302.3298 326.9251 343.5024 357.8985 388.8954 408.1198 412.3225 417.0175 468.2654 508.1413 522.7703 537.8684 563.6362 567.9857 595.5780 614.8773 622.6498 652.7709 667.3211 692.4635 708.8890 729.9625 742.3773 762.9126 768.9633 785.8207 808.4826 829.6540 848.9083 866.2702 882.3486 905.0347 952.2464 966.7230 973.9958 979.3182 985.1257 988.3441 988.7679 998.3955 1010.4433 1028.2470 1045.3479 1065.6511 1095.1247 1114.8633 1115.1440 1147.1820 1149.4510 1160.2275 1169.7432 1175.9630 1184.5707 1198.6851 1209.5371 1230.0094 1251.2553 1299.0134 1327.2948 1337.3697 1351.2451 1369.7614 1384.7058 1385.8279 1409.9099 1423.2179 1443.9949 1452.9678 1453.7564 1454.6869 1457.8042 1461.9139 1484.6229 1489.9934 1564.6212 1582.5347 1592.3815 1609.1054 1613.2504 1637.2723 1654.7397 3009.0405 3009.2166 3038.8230 3095.7710 3102.0497 3113.1353 3129.8701 3133.9010 3140.0841 3145.1162 3156.9790 3157.3240 3158.1403 3168.8017 3177.1665 3198.3299 3210.8236
redmass: 1.0444 6.4151 6.0314 5.1218 4.5868 5.9675 4.0569 3.7928 5.6854 1.2036 3.9778 6.3712 5.1763 4.3048 5.5114 5.5499 6.8707 4.5085 5.2834 5.8520 5.2178 5.9252 5.0794 2.6196 2.8737 3.5732 4.3637 5.5337 3.5929 3.1783 4.2246 3.7814 3.6879 5.1438 6.2901 6.6468 5.6229 5.4302 1.9153 5.9870 5.1021 6.4481 2.2111 3.4691 4.6828 4.8784 1.2623 1.3048 1.5698 6.9662 1.4384 4.0551 1.3915 1.4413 3.6679 4.4230 1.3546 1.3934 1.9162 2.8359 2.8081 1.6043 2.7347 1.7624 1.2656 1.3232 1.8749 1.8544 2.7718 3.2678 1.1804 2.6907 1.4989 1.1702 2.2958 3.7768 1.2783 1.6851 1.2593 1.6882 6.2847 7.7845 1.2252 3.6900 1.1830 1.9223 1.2124 1.0643 1.0496 1.0456 1.0512 2.4793 2.2139 9.8512 7.6764 6.5889 6.3103 6.1395 9.4216 11.0481 1.0295 1.0369 1.0593 1.0970 1.1027 1.1050 1.0850 1.0910 1.0899 1.1010 1.0939 1.0885 1.1049 1.0992 1.0975 1.0947 1.0942
irintensity: 1.2274 0.1175 2.2322 1.3329 2.3387 0.8845 1.7244 0.5079 1.0418 0.2733 1.3815 1.6205 1.7857 5.6716 3.8667 2.2556 4.2737 4.2474 8.3640 3.7994 8.7459 2.2016 10.0970 1.0113 0.2727 1.8894 8.1641 1.3955 5.8555 8.8405 14.0965 8.7162 5.2037 4.9137 1.5152 2.0145 31.8926 26.0805 37.4925 7.3349 12.6279 2.3397 34.0591 54.4285 10.4100 4.9448 0.2664 9.7228 72.7475 80.6301 5.2011 79.3621 1.2156 5.2904 121.6124 14.1019 1.5439 0.0216 60.3933 10.2952 4.8082 9.9659 32.2280 5.7159 0.3805 18.6526 263.9109 246.9586 38.1641 400.7422 29.6132 141.7764 47.8889 14.6023 144.3456 156.6473 2.0915 145.1974 26.5679 164.8078 2.3330 5.2496 53.2979 18.3191 16.6528 2.1942 19.9175 14.2565 13.8960 18.1747 10.9622 23.7478 121.5894 98.1420 32.8136 29.1751 75.1733 22.7068 191.2755 204.4653 28.5782 2.6545 18.3786 5.1366 4.0594 20.7624 1.1883 7.5854 14.9264 6.7918 30.2874 2.1397 9.4806 18.4193 3.5545 1.5249 4.2742
temp: 298.150 k
press: 1.00000 atm
elementType: 8 8 8 8 8 7 6 6 6 6 6 6 6 6 6 6 6 6 6 6 6 6 6 6 1 1 1 1 1 1 1 1 1 1 1 1 1 1 1 1 1
symmnumber: 1
zpe: 821141.4 jmol-1
zpe.correction: 0.312756 hartree
zpe.thermalcorrener: 0.335060 hartree
zpe.thermalcorrenthalpy: 0.336004 hartree
zpe.thermalcorrgfe: 0.257140 hartree
zpe.sumelectzpe: -1125.265065 hartree
zpe.sumelectthermal: -1125.242761 hartree
zpe.sumelectthermalent: -1125.241817 hartree
zpe.sumelectthermalfe: -1125.320681 hartree
dipole: -2.1794 1.8788 0.5368
dipole: 2.9270
quadrupole: -112.5832 -134.4705 -147.0817
quadrupole: -5.2983 -7.7813 10.1598
quadrupole: 18.7953 -3.0921 -15.7033 -5.2983 -7.7813 10.1598
hfenergy: -1125.577821 hartree
pointgroup: C01 [X(C18H17N1O5)]
dipole: -0.933305 0.5642052 0.3698071 debye
polarizability: 349.2537637|0.2192034|170.0057667|-4.6860754|-3.7810457|175.2326042 unknown
InChI: InChI=1S/C18H17NO5/c1-13(20)24-16-10-8-14(9-11-16)18(22)19(12-17(21)23-2)15-6-4-3-5-7-15/h3-11H,12H2,1-2H3
charge 0 multiplicity 1
41 atoms
O  1.128817 -1.364609 1.655383
O  1.264846 2.330031 1.300524
O  -5.008392 -0.5402 0.134415
O  1.822935 3.616752 -0.561341
O  -5.396216 -0.813865 -2.17568
N  1.5777 -0.003484 -0.218448
C  2.978256 -0.346677 -0.307552
C  1.146954 1.254295 -0.856432
C  0.70718 -0.656567 0.694974
C  -0.775951 -0.533683 0.455716
C  3.418273 -1.670518 -0.029014
C  3.930394 0.612552 -0.747651
C  -1.626968 -0.362605 1.577158
C  -1.355454 -0.737668 -0.821927
C  1.472015 2.526953 -0.055684
C  -3.02277 -0.35928 1.416995
C  -2.756048 -0.754903 -1.001759
C  -3.580568 -0.553207 0.131132
C  4.774901 -2.014045 -0.18586
C  5.288159 0.253926 -0.902667
C  5.72272 -1.058443 -0.622222
C  1.530108 3.499371 2.177142
C  -5.826209 -0.675434 -1.013089
C  -7.281466 -0.629599 -0.604307
H  1.603337 1.363837 -1.853391
H  0.052987 1.240121 -0.986376
H  2.708553 -2.421103 0.321417
H  3.640967 1.642815 -0.973622
H  -1.179786 -0.24788 2.569045
H  -0.709504 -0.920189 -1.688949
H  -3.694888 -0.219714 2.26852
H  -3.192685 -0.923787 -1.985924
H  5.091574 -3.039591 0.03431
H  6.00285 1.011059 -1.243774
H  6.776079 -1.333385 -0.740708
H  2.579073 3.820643 2.067769
H  0.860645 4.333362 1.90824
H  1.329877 3.135387 3.193665
H  -7.393189 -0.455462 0.474631
H  -7.764851 -1.5840 -0.877913
H  -7.792954 0.168596 -1.169446
