program: Gaussian 09
title: 000291987
version: EM64L-G09RevD.01
frameworkgroup: C1[X(C8H14)]
method: RPBEPBE
basis: SDD
operation: Freq
keyword: #p
keyword: freq=noraman
keyword: PBEPBE/SDD
title: #p freq=noraman PBEPBE/SDD
converged: YES YES NO NO
title: Mulliken charges:
elementType: C C C C C C C C H H H H H H H H H H H H H H
charge: -0.526868 -0.482131 0.546093 -0.131381 -0.820294 -0.186335 -0.736037 -0.731327 0.221109 0.201886 0.206327 0.208021 0.236483 0.228101 0.221086 0.228096 0.213455 0.222635 0.217522 0.220251 0.220016 0.223295
chargesum: 0.00000
title: Mulliken charges with hydrogens summed into heavy atoms:
elementType: C C C C C C C C
charge: -0.103874 -0.067784 0.546093 0.105102 -0.143011 0.027120 -0.295881 -0.067766
polarizability: 1.05526814e+02 -1.26111378e+00 8.79033913e+01 -5.24076643e+00 -2.64271050e+00 6.87290582e+01
1716.lowfreq: -11.2697 -10.9077 -0.0006 -0.0002 0.0002 10.1597 31.6233 58.9683 79.3789
frequency: 29.6819 58.5437 79.3425 146.0991 187.1286 195.9595 217.7667 298.0546 380.8419 393.8496 419.0270 475.1257 542.2087 696.0192 755.4759 773.8615 833.7416 915.8050 934.9958 940.9764 971.2425 977.6954 1001.6706 1033.7210 1043.7852 1050.2951 1092.1511 1115.8406 1159.2380 1211.6479 1283.1925 1294.6659 1297.3151 1306.1563 1345.5621 1392.0375 1393.6391 1426.3488 1454.2863 1460.4395 1462.6266 1470.5871 1472.7949 1480.5034 1668.0123 1689.7123 2955.8293 2962.4641 2963.0076 2966.7592 3023.7660 3036.2333 3037.2837 3044.8693 3064.6147 3079.4598 3084.9594 3085.5306 3089.0653 3188.3787
redmass: 2.7631 2.5800 1.9112 1.7698 1.2761 1.2665 2.7982 2.0682 2.1912 2.4482 2.2515 2.5308 2.0918 1.0891 2.4239 1.5193 1.8253 2.1087 1.4372 1.3541 1.3373 1.0916 2.0000 1.5269 1.5289 1.7981 2.8423 1.9334 1.2703 1.2609 1.5515 1.5726 1.3624 1.3332 1.5217 1.2356 1.2400 1.1710 1.0757 1.0848 1.0477 1.0689 1.0568 1.0704 4.9812 6.1447 1.0625 1.0481 1.0386 1.0509 1.0965 1.0971 1.0963 1.0976 1.0926 1.0957 1.0916 1.0689 1.0911 1.1140
irintensity: 0.1048 0.1223 0.2816 0.6418 1.9124 1.3750 1.2254 2.1662 0.5055 3.0657 0.4511 0.1617 12.4170 0.5207 2.0291 1.2520 1.3776 0.9858 10.2283 94.4320 6.2559 43.2968 1.4862 15.3081 0.1521 3.7819 2.2371 1.2786 1.2094 2.0544 5.9387 2.7508 2.0707 1.1059 0.0831 25.2507 12.1656 1.4715 2.8752 16.5578 14.2162 26.4196 21.5850 4.8788 25.0188 1.1736 25.9218 33.3721 28.8411 62.5753 24.3869 28.4879 29.8601 45.2291 2.9493 3.2454 32.8774 2.4817 79.7095 28.1401
temp: 298.150 k
press: 1.00000 atm
elementType: 6 6 6 6 6 6 6 6 1 1 1 1 1 1 1 1 1 1 1 1 1 1
symmnumber: 1
zpe: 510876.6 jmol-1
zpe.correction: 0.194583 hartree
zpe.thermalcorrener: 0.204931 hartree
zpe.thermalcorrenthalpy: 0.205875 hartree
zpe.thermalcorrgfe: 0.158079 hartree
zpe.sumelectzpe: -312.564157 hartree
zpe.sumelectthermal: -312.553809 hartree
zpe.sumelectthermalent: -312.552864 hartree
zpe.sumelectthermalfe: -312.600661 hartree
dipole: 0.1460 -0.5309 0.1761
dipole: 0.5781
quadrupole: -49.9881 -49.9129 -51.3644
quadrupole: 1.1107 -2.4914 1.1678
quadrupole: 0.4337 0.5089 -0.9426 1.1107 -2.4914 1.1678
hfenergy: -312.7587398 hartree
pointgroup: C01 [X(C8H14)]
dipole: -0.0644378 -0.1138283 -0.1860649 debye
dipolederiv: 0.0551563 -0.0652171 -0.0111828 -0.0513815 0.0511054 0.0141709 0.0169919 -0.0375609 0.0376716 0.0441334 0.0552687 -0.0035333 -0.0308001 0.0695634 -0.0334666 0.0175995 -0.007099 0.1818808 0.0593446 0.1561875 -0.0837746 0.2903182 0.1570646 0.0703428 -0.0858759 0.0601269 0.2982033 -0.0148848 0.0480413 -0.0611089 -0.0778138 0.0806992 0.0529821 -0.1454106 0.0539695 -0.2398999 0.0232907 -0.0629434 0.0458044 -0.0838254 0.0135996 0.0268112 0.083007 0.0512601 -0.1170437 0.1195494 0.0059197 -0.1020375 -0.0554159 0.175044 0.1048643 -0.1102743 0.0888569 -0.2175346 -0.330867 0.192142 -0.126331 0.1551473 -0.1801282 -0.0696597 -0.1327865 -0.0567813 -0.2070039 -0.1020175 0.0935224 0.0570311 0.0375308 -0.0100906 -0.0400746 0.0707172 -0.0457617 0.1063828 0.0339648 -0.0551359 0.0485386 -0.0473813 0.0488428 0.015685 0.0351248 0.0825367 -0.1386851 -0.0969219 0.1120738 0.0222715 0.083436 -0.1072173 -0.0762395 0.0438552 -0.0852101 0.0573947 -0.0135288 0.0344975 0.1001513 0.0790443 0.0574687 0.0560516 0.1023903 0.0200209 -0.1432368 -0.0457151 -0.1374355 -0.0354001 -0.0590383 -0.1375458 -0.0332764 -0.014128 -0.0011173 0.0706616 0.0709131 -0.0463998 0.0254917 -0.0353484 -0.1173585 -0.0415465 0.0363035 -0.0509011 0.1306307 -0.0125681 -0.1211175 0.027905 -0.1542602 -0.0605728 0.0151838 -0.0344216 -0.0445511 0.0782776 0.0434038 0.0777973 0.0920859 0.1262356 -0.057349 -0.0851909 0.0523838 -0.0557154 0.019973 -0.015041 0.0553515 -0.1261103 0.0421833 0.1008182 0.0435257 -0.1116533 0.0197437 -0.060963 0.0364131 -0.0256907 0.0223231 -0.0419 -0.1608411 -0.0497156 0.0183251 -0.0547233 0.1407764 0.1178022 -0.0733728 0.1106572 -0.0801184 0.0840907 0.0532929 0.0986506 0.0294302 -0.0657747 0.0776112 -0.1581885 0.0164716 -0.1777939 -0.0318813 -0.028286 0.0332858 0.0062544 0.0811731 0.0177146 0.0008592 0.0950869 0.036247 0.0624476 0.0599888 0.1633404 0.0280301 -0.1070104 -0.1072351 0.0461756 -0.1062777 0.079968 0.0788055 -0.0239443 -0.1477034 0.0139927 -0.0025684 0.0394819 -0.1323356 -0.008062 -0.0350334 -0.1165649 -0.0314992 0.0102783 -0.0148008 0.0966949 unknown
polarizability: 105.2201563|4.8104839|77.2099909|-4.1865201|9.6939837|79.7291161 unknown
InChI: InChI=1S/C8H14/c1-4-5-6-7-8(2)3/h4-5H,2,6-7H2,1,3H3
charge 0 multiplicity 1
22 atoms
C  1.023582 -1.105506 0.176477
C  -0.236126 -1.036479 -0.745785
C  1.873663 0.160851 0.180235
C  -1.238117 0.013527 -0.311652
C  2.498914 0.565397 -1.14478
C  -2.54941 -0.22615 -0.046517
C  2.074507 0.882173 1.315921
C  -3.553659 0.81749 0.39208
H  0.697248 -1.338626 1.207022
H  1.64993 -1.955278 -0.169853
H  0.096381 -0.834744 -1.785593
H  -0.72255 -2.031068 -0.760823
H  -0.849527 1.037358 -0.196086
H  3.16207 1.439753 -1.030528
H  3.092379 -0.266822 -1.572431
H  1.726024 0.822028 -1.895545
H  -2.92972 -1.254998 -0.152745
H  1.619718 0.587546 2.269214
H  2.698216 1.784223 1.324534
H  -3.998544 0.558264 1.372994
H  -4.392647 0.896084 -0.32712
H  -3.085033 1.813676 0.481484
