program: Gaussian 09
title: 000291994
version: EM64L-G09RevD.01
frameworkgroup: C1[X(C14H12O3)]
method: RPBEPBE
basis: SDD
operation: Freq
keyword: #pfreq=noraman
keyword: PBEPBE/SDD
title: #p freq=noraman PBEPBE/SDD
converged: YES YES NO NO
title: Mulliken charges:
elementType: O O O C C C C C C C C C C C C C C H H H H H H H H H H H H
charge: -0.297578 -0.445581 -0.257117 0.331372 0.438911 0.339368 -0.359315 -0.377317 -0.364447 -0.357655 -0.371717 -0.341726 0.254641 -0.328075 -0.315601 -0.804294 0.107860 0.265508 0.257445 0.235045 0.235232 0.262355 0.270707 0.273827 0.274163 0.226112 0.238496 0.226474 0.382911
chargesum: 0.00000
title: Mulliken charges with hydrogens summed into heavy atoms:
elementType: O O O C C C C C C C C C C C C C C
charge: -0.297578 -0.062671 -0.257117 0.331372 0.438911 0.339368 -0.093808 -0.119873 -0.129402 -0.122423 -0.109362 -0.071019 0.254641 -0.054247 -0.041438 -0.113213 0.107860
polarizability: 2.80275546e+02 -4.93660669e+00 1.41057797e+02 -1.30740468e+01 -2.68177718e+00 9.56980921e+01
1716.lowfreq: -40.9670 -5.3261 0.0004 0.0005 0.0009 3.2148 7.5569 24.7638 38.3287
frequency: -40.5108 24.6815 38.1275 53.2840 84.5335 105.1116 135.8946 183.4273 246.7922 265.7679 308.4133 318.0115 377.3874 402.2270 412.5304 417.5759 468.4574 489.6580 494.8062 536.9089 580.7475 591.0277 624.6595 632.1780 674.7809 685.7676 714.4681 741.0324 755.3886 795.2100 824.9352 833.6463 843.8693 856.2765 862.5215 947.0537 967.3897 983.0777 986.0656 991.6509 995.8465 1007.3366 1016.3757 1047.3521 1113.6198 1116.0906 1148.4427 1156.0423 1177.3190 1191.1437 1215.2910 1231.6810 1294.6197 1300.7853 1321.7449 1365.8585 1383.3781 1399.7239 1406.8212 1427.0690 1472.8441 1473.2624 1487.8830 1496.5091 1576.2611 1593.7130 1610.2898 1622.7374 1641.7017 2976.0593 3057.2742 3085.6345 3127.3473 3131.5423 3156.2075 3157.7194 3160.6848 3169.2111 3176.1177 3181.3075 3534.7772
redmass: 1.0154 4.8607 5.4204 5.0347 5.3817 6.4482 4.8096 6.5129 5.3117 5.5432 4.4829 3.8301 4.9357 4.9626 2.9836 2.9993 4.3934 3.0958 3.7956 4.7871 1.4544 2.9059 6.7521 6.5737 4.8239 3.8454 3.4034 5.0034 4.5729 4.5378 1.5219 1.3239 1.2448 4.6865 1.8139 1.3120 1.3665 1.3397 1.3985 1.3494 4.4591 2.8530 2.7080 1.5472 1.2789 1.2796 1.7826 1.9217 1.2996 1.4413 2.6673 4.8647 1.3104 1.2996 2.6905 5.3977 6.1660 1.2229 3.3276 4.3481 1.0896 1.0591 2.6206 2.6677 7.6257 6.8450 6.3313 6.5202 8.4607 1.0388 1.0951 1.0998 1.0892 1.0896 1.0887 1.0949 1.0893 1.0958 1.0967 1.0971 1.0641
irintensity: 0.6181 0.6709 0.2402 0.1015 0.7846 0.9527 1.4083 0.1171 0.5170 0.9513 2.7997 1.9441 7.8243 6.9642 1.0137 1.6152 27.0757 40.3856 10.8841 32.6390 64.2075 36.8697 2.4717 2.5787 20.1525 45.8809 3.7166 3.6907 26.0304 4.0426 45.7748 15.8720 0.9751 49.9817 54.0021 2.2003 0.2046 1.2510 0.5143 0.3341 175.6087 14.2834 171.7628 22.0441 11.5719 10.8497 142.1994 82.8723 45.5095 42.3492 141.5695 354.2072 6.6540 9.9092 149.9733 0.4730 6.9079 9.9991 1.3465 22.8689 12.9322 12.7555 316.4751 27.6534 31.1668 18.6587 196.9635 44.1422 373.9125 39.6572 21.2478 17.3436 15.2754 23.4708 0.4683 8.6369 1.7236 3.4819 4.0346 1.7805 50.0603
temp: 298.150 k
press: 1.00000 atm
elementType: 8 8 8 6 6 6 6 6 6 6 6 6 6 6 6 6 6 1 1 1 1 1 1 1 1 1 1 1 1
symmnumber: 1
zpe: 582946.0 jmol-1
zpe.correction: 0.222032 hartree
zpe.thermalcorrener: 0.236266 hartree
zpe.thermalcorrenthalpy: 0.237210 hartree
zpe.thermalcorrgfe: 0.179055 hartree
zpe.sumelectzpe: -765.173371 hartree
zpe.sumelectthermal: -765.159137 hartree
zpe.sumelectthermalent: -765.158193 hartree
zpe.sumelectthermalfe: -765.216349 hartree
dipole: 3.8162 -1.9510 -0.3768
dipole: 4.3025
quadrupole: -96.0049 -93.2109 -98.0092
quadrupole: 3.5794 0.8458 -1.7572
quadrupole: -0.2632 2.5308 -2.2676 3.5794 0.8458 -1.7572
hfenergy: -765.3954034 hartree
pointgroup: C01 [X(C14H12O3)]
dipole: 1.4805884 -0.8048313 -0.1595911 debye
polarizability: 280.3795943|-8.5712567|141.6198316|-9.1593671|0.2199138|95.0320092 unknown
InChI: InChI=1S/C14H12O3/c1-10-2-6-12(7-3-10)17-13-8-4-11(5-9-13)14(15)16/h2-9,15H,1H3
charge 0 multiplicity 1
29 atoms
O  0.757107 1.432175 0.135528
O  -4.754067 -1.776488 -0.681791
O  -5.608115 0.203457 0.181627
C  1.92523 0.61482 0.108929
C  4.381571 -0.805391 0.120775
C  -0.52904 0.86714 0.06552
C  2.086541 -0.487413 0.976985
C  2.969229 1.025317 -0.743449
C  3.310678 -1.190197 0.969738
C  4.188346 0.312836 -0.731302
C  -1.584839 1.714877 0.484074
C  -0.794414 -0.428936 -0.444736
C  -3.194315 -0.039673 -0.101085
C  -2.909683 1.25999 0.400346
C  -2.127077 -0.873816 -0.525096
C  5.706454 -1.54782 0.147383
C  -4.60822 -0.473209 -0.167414
H  1.276243 -0.784485 1.650642
H  2.817155 1.889159 -1.397353
H  3.437246 -2.047146 1.642078
H  5.000223 0.630134 -1.396413
H  -1.34203 2.710751 0.865167
H  0.024458 -1.069545 -0.78387
H  -3.743144 1.893541 0.720147
H  -2.353056 -1.867393 -0.921731
H  6.216645 -1.500763 -0.830721
H  6.393438 -1.109532 0.89734
H  5.570739 -2.611638 0.410161
H  -5.723201 -1.998453 -0.700081
