program: Gaussian 09
title: 000291990
version: EM64L-G09RevD.01
frameworkgroup: C1[X(C10H16)]
method: RPBEPBE
basis: SDD
operation: Freq
keyword: #p
keyword: freq=noraman
keyword: PBEPBE/SDD
title: #p freq=noraman PBEPBE/SDD
converged: YES YES NO NO
title: Mulliken charges:
elementType: C C C C C C C C C C H H H H H H H H H H H H H H H H
charge: -0.706701 0.438483 0.574676 -0.422744 -0.822210 0.440601 -0.807148 -0.749257 -0.809343 -0.718932 0.210937 0.220228 0.202435 0.230270 0.250785 0.224089 0.226050 0.220222 0.236129 0.219340 0.220772 0.223069 0.229586 0.223165 0.214604 0.230895
chargesum: 0.00000
title: Mulliken charges with hydrogens summed into heavy atoms:
elementType: C C C C C C C C C C
charge: -0.275536 0.438483 0.574676 -0.220309 -0.117067 0.440601 -0.124747 -0.309144 -0.133524 -0.273432
polarizability: 1.52210299e+02 -1.13142868e+01 9.54727767e+01 1.29113402e+01 5.75130218e+00 8.97247462e+01
1716.lowfreq: -9.3034 -0.0005 -0.0004 0.0006 6.0316 14.3564 37.3197 54.7017 57.4976
frequency: 37.1676 54.6797 57.4660 109.6295 161.1681 168.9462 181.3136 190.3138 237.9546 297.1788 342.7436 381.7891 411.0381 427.2524 455.0998 517.2634 526.9875 616.6972 686.3123 713.3357 804.1912 825.7492 874.3865 883.2701 921.0479 928.3620 943.7320 966.3239 989.2978 1003.7476 1006.9334 1028.4622 1044.7187 1049.9601 1059.9315 1174.4298 1191.0610 1266.5044 1284.3739 1288.1991 1375.1859 1390.2892 1393.1058 1398.7318 1424.3640 1426.3256 1448.6427 1458.4742 1461.7519 1463.9311 1469.4115 1475.6465 1478.1582 1636.8967 1651.5635 1671.4486 2958.0595 2965.2186 2965.8203 2967.3349 3019.1537 3038.5542 3039.3486 3043.6094 3058.5884 3085.0549 3085.8155 3087.1117 3088.5681 3100.7557 3188.1749 3206.2260
redmass: 2.9455 2.8969 2.7027 2.6414 1.1065 1.1612 1.9167 2.2569 1.5528 2.8828 2.7831 2.2339 2.4571 2.4309 2.0137 2.4299 2.3520 2.0604 1.1070 1.2350 2.7607 3.2823 2.3210 1.6421 1.5254 1.4121 1.3307 1.6337 1.7432 1.4153 1.4043 1.4653 1.5452 1.5354 1.6702 1.4242 1.6516 2.7475 2.6033 1.5496 1.4548 1.2215 1.2366 1.3440 1.2087 1.1842 1.0906 1.0520 1.0488 1.0689 1.0588 1.0632 1.0620 5.0664 5.7957 5.1090 1.0570 1.0385 1.0380 1.0373 1.1017 1.0947 1.0959 1.0968 1.0871 1.0984 1.0638 1.0982 1.0987 1.0628 1.1139 1.1135
irintensity: 0.0628 0.4159 0.0567 0.6437 0.3068 0.3083 0.2484 1.7439 0.3316 0.0113 1.1587 1.9687 2.9765 8.7116 2.0209 6.5539 9.2553 4.3533 3.0033 1.0397 3.0621 0.5904 0.9338 5.6670 21.1533 56.9965 78.6024 0.7678 1.7425 1.9716 4.4513 19.2201 3.4010 3.2952 10.6342 3.2659 3.9873 7.9965 12.5112 3.7988 7.2026 17.1821 22.5718 22.6679 0.6280 1.1776 2.9047 20.3199 11.6815 25.5301 12.7815 25.9535 7.4349 27.5009 41.9112 10.4884 36.8950 21.9479 24.1666 27.8650 22.8542 24.8985 23.1696 25.1976 30.4960 14.0473 18.6245 28.5649 29.4421 8.5751 25.5541 23.8234
temp: 298.150 k
press: 1.00000 atm
elementType: 6 6 6 6 6 6 6 6 6 6 1 1 1 1 1 1 1 1 1 1 1 1 1 1 1 1
symmnumber: 1
zpe: 595921.8 jmol-1
zpe.correction: 0.226975 hartree
zpe.thermalcorrener: 0.239541 hartree
zpe.thermalcorrenthalpy: 0.240486 hartree
zpe.thermalcorrgfe: 0.187878 hartree
zpe.sumelectzpe: -389.823310 hartree
zpe.sumelectthermal: -389.810743 hartree
zpe.sumelectthermalent: -389.809799 hartree
zpe.sumelectthermalfe: -389.862406 hartree
dipole: 0.1013 -0.3113 -0.1294
dipole: 0.3521
quadrupole: -62.4585 -62.2388 -63.1565
quadrupole: -1.5465 -1.1401 0.6826
quadrupole: 0.1594 0.3792 -0.5386 -1.5465 -1.1401 0.6826
hfenergy: -390.0502848 hartree
pointgroup: C01 [X(C10H16)]
dipole: -0.0383587 -0.1206363 0.0562147 debye
dipolederiv: -0.1021412 0.0432024 0.0261781 -0.0932817 0.0929956 -0.0199666 0.0354482 -0.0123005 0.0708557 0.310763 0.003628 0.0903744 0.0969715 0.2398287 -0.0073593 0.1005266 -0.0425801 -0.1385921 0.3067507 0.1124455 -0.0404574 0.2595119 0.0281406 0.1703294 -0.1766819 0.1647447 0.2138217 -0.3141866 -0.0496124 0.0662947 -0.1424607 0.0137539 -0.0962122 0.1241019 -0.0344278 -0.1754656 -0.0654297 -0.001246 -0.0257001 0.0381529 -0.1720161 0.0723507 0.0311022 0.0691672 0.091902 0.4729747 0.1071027 -0.0176665 0.0162357 0.0866755 -0.1679024 -0.0463247 -0.1684906 0.1422394 -0.0280617 -0.0263611 -0.0407401 -0.05067 0.027562 -0.0993009 0.0375714 -0.0891479 -0.1159061 -0.3065173 0.0615115 -0.1484614 0.0639561 -0.3766116 0.0964645 -0.0702431 0.094227 -0.045219 -0.0906214 -0.0749877 0.0399257 -0.0704352 0.0135829 0.0672119 0.0229586 0.0701124 0.0198437 -0.1075188 -0.0093487 -0.0378066 0.0770218 -0.3412453 -0.0673404 -0.070034 -0.104153 -0.3408815 0.0136855 -0.0713279 0.0361054 -0.010262 -0.1534082 0.0650889 0.0416744 0.0148818 0.0761181 -0.0395425 -0.0170876 -0.0812734 -0.0041092 0.0402995 -0.1205771 -0.0623419 -0.0628117 -0.1097896 0.0468517 0.0178898 -0.0426321 0.0385734 -0.1372364 0.0799189 -0.0002643 0.0791041 0.1163656 0.063157 -0.0249075 0.0672728 -0.0849382 0.0513252 -0.0086998 0.1002907 0.0583476 -0.0773653 -0.051568 0.1320619 0.0337114 0.0717062 0.0484709 0.0062486 -0.009014 0.0157854 0.0872782 0.0050401 -0.0956717 -0.1107952 -0.0876459 0.0395688 -0.0356841 -0.1268148 -0.0944085 -0.017995 -0.0842413 -0.0091593 0.1520966 -0.0466835 0.0947304 0.0217258 0.105242 -0.0133884 -0.0110837 0.1046067 -0.0580902 0.0090982 -0.0488558 -0.1440675 -0.0187739 -0.027913 0.040848 0.0573334 -0.0479793 0.0584446 -0.1082814 0.0559416 0.054849 0.0461706 -0.1374103 -0.0005092 0.031965 0.1121105 -0.0374237 0.0266635 -0.0479282 0.1184934 -0.1054787 -0.0123948 -0.1177848 -0.0873333 -0.0456295 -0.0474573 0.1009216 -0.0727589 0.1624758 -0.0378449 0.1545492 -0.0225222 0.0022966 0.0778464 0.0429553 0.0388146 -0.0149464 -0.1603629 -0.0081546 0.0135543 -0.0349284 0.0932924 0.0923979 -0.0375082 0.00092 -0.0073232 0.0881424 -0.0291028 0.0428364 -0.0016881 -0.1524996 -0.1478911 0.0123079 -0.0434385 0.0799564 0.0713137 0.0428496 -0.1152095 0.0304924 0.0585849 -0.1350128 0.0456349 -0.0686053 0.0584871 0.1321277 0.0636337 -0.0283214 0.0646274 0.1202404 -0.0398431 -0.0769954 0.0774811 -0.0742159 0.0806119 0.0904051 0.0731118 0.096803 0.0899938 unknown
polarizability: 151.9530299|12.5240863|95.2513624|12.4069486|-5.8467302|90.2034292 unknown
InChI: InChI=1S/C10H16/c1-8(2)6-10(5)7-9(3)4/h6H,1,3,7H2,2,4-5H3
charge 0 multiplicity 1
26 atoms
C  1.321278 -0.409297 0.953831
C  0.027646 0.242213 0.45529
C  2.491855 -0.272699 -0.024866
C  -1.09977 -0.521447 0.290532
C  0.108893 1.736988 0.216387
C  -2.452577 -0.116774 -0.16187
C  2.305995 -0.934392 -1.378329
C  3.628854 0.392142 0.311678
C  -3.599987 -0.886227 0.482288
C  -2.697331 0.83672 -1.111276
H  1.132946 -1.485695 1.144464
H  1.613086 0.051448 1.91939
H  -1.018593 -1.583643 0.576274
H  0.547994 1.966245 -0.775153
H  -0.885132 2.213325 0.260005
H  0.773251 2.209531 0.964164
H  3.178727 -0.776407 -2.034455
H  2.151303 -2.025747 -1.263174
H  1.404904 -0.544969 -1.890022
H  3.751062 0.860995 1.295671
H  4.4713 0.481284 -0.384312
H  -3.491684 -1.974199 0.303108
H  -3.607664 -0.742034 1.579786
H  -4.578836 -0.56973 0.083634
H  -3.721958 1.089717 -1.408519
H  -1.890863 1.356753 -1.636627
