program: Gaussian 09
title: 000292021
version: EM64L-G09RevD.01
frameworkgroup: C1[X(C18H21NOS)]
method: RPBEPBE
basis: SDD
operation: Freq
keyword: #p
keyword: freq=noraman
keyword: PBEPBE/SDD
title: #p freq=noraman PBEPBE/SDD
converged: YES YES NO NO
title: Mulliken charges:
elementType: S O N C C C C C C C C C C C C C C C C C C H H H H H H H H H H H H H H H H H H H H H
charge: -0.039044 -0.262198 -0.137699 -0.011827 -0.434610 -0.691832 -0.698807 0.425218 -0.494043 0.470256 -0.333858 -0.384568 -0.317918 -0.340770 -0.220648 -0.218099 -0.247099 -0.368567 -0.356632 0.324864 -0.537916 0.199501 0.205700 0.258009 0.215167 0.245037 0.206749 0.212725 0.203623 0.235101 0.263946 0.243329 0.245675 0.266596 0.230868 0.228674 0.231203 0.240768 0.251241 0.246572 0.223349 0.221963
chargesum: 0.00000
title: Mulliken charges with hydrogens summed into heavy atoms:
elementType: S O N C C C C C C C C C C C C C C C C C C
charge: -0.039044 -0.262198 -0.137699 0.187674 0.029099 -0.024879 -0.047359 0.425218 -0.494043 0.470256 -0.069912 -0.141239 -0.072243 -0.074174 0.010220 0.010575 -0.015895 -0.127799 -0.105391 0.324864 0.153969
polarizability: 2.73912012e+02 -1.61846711e+01 2.54588106e+02 -1.65088673e+01 -1.09795154e+01 1.64369291e+02
1716.lowfreq: -8.9964 -6.6512 -3.2528 -0.0017 -0.0013 -0.0005 25.4939 37.9806 40.1015
frequency: 25.4690 37.9613 40.0638 51.0430 67.3336 70.8699 90.7773 110.0870 129.6572 140.1373 189.6526 206.0539 215.3429 224.6442 239.8784 246.4618 254.6159 277.2251 302.9335 346.9579 370.1003 399.2925 408.7403 412.4934 415.7004 437.2944 470.9424 510.5751 519.8168 558.1111 601.7590 608.8695 619.7023 640.7359 658.7117 697.8940 733.9737 743.5204 768.6856 782.7195 801.9398 806.5014 840.9935 842.3493 899.8783 916.0844 920.6834 929.2245 938.6601 962.8105 968.7495 971.0699 974.4967 986.2657 988.3298 994.2902 1003.0870 1023.2302 1059.7040 1084.2789 1108.8611 1111.5131 1122.4513 1132.3163 1156.2297 1172.4766 1177.6076 1180.8418 1188.9063 1206.6981 1234.6877 1238.6188 1272.1205 1301.0782 1306.5850 1320.9969 1324.6072 1361.8093 1370.2444 1374.9664 1381.4559 1387.8445 1401.0995 1422.1894 1435.4989 1441.5255 1449.1225 1461.9301 1467.2427 1472.0563 1472.6455 1478.1387 1481.5357 1488.5446 1496.4467 1570.7968 1589.5945 1604.4683 1613.4153 2954.5736 2962.4458 2975.2312 2979.6095 2991.4074 3051.9087 3060.8647 3064.5092 3070.2675 3084.4811 3089.8077 3126.6723 3127.9764 3135.9015 3146.0588 3148.4848 3149.6933 3158.9637 3166.7121 3170.7312 3173.1172
redmass: 4.7058 3.8015 3.2679 3.4534 3.6401 3.7595 4.4519 4.2699 4.8294 4.1833 1.1834 2.3271 3.8149 4.4906 1.6525 1.8957 1.3587 3.8429 5.2992 3.2810 2.5192 2.5473 3.5495 2.7835 3.3588 4.3349 3.9976 3.1253 3.0581 4.1159 4.9546 6.2152 6.1498 6.0139 3.9345 1.8260 3.9121 4.3555 2.2008 3.4329 3.2576 1.3378 1.5347 1.2738 1.5499 1.4944 2.0918 1.7786 1.3807 1.6339 1.3744 2.2820 1.3887 8.3828 5.7065 1.3308 2.5825 2.2795 2.7116 1.5718 1.5386 1.2601 1.7351 1.9997 1.3368 1.0576 1.5569 1.2305 1.5068 3.0170 3.0560 1.6467 2.6321 1.3022 1.6440 1.5724 1.4554 3.6535 1.5807 3.4090 1.2540 2.3235 1.2189 4.0640 1.1764 2.2348 1.1085 1.0503 1.0504 1.0907 1.0749 1.8527 1.1364 1.0556 2.4785 7.2695 6.3659 6.1317 6.2454 1.0817 1.0328 1.0364 1.0365 1.0622 1.1041 1.1004 1.0996 1.0991 1.0990 1.0998 1.0996 1.0849 1.0881 1.0873 1.0933 1.0884 1.0960 1.0958 1.1010 1.0969
irintensity: 1.0766 0.1477 0.5586 0.8315 0.1912 1.1291 0.4674 4.6783 0.3638 2.7969 0.3297 1.6335 3.8799 1.8453 0.4299 2.4053 0.4022 0.8242 3.2364 1.0686 0.2594 4.3291 0.2658 0.2683 2.4077 2.3337 3.0105 5.9402 10.4479 37.2068 11.5174 1.1633 2.0668 2.4168 3.5289 49.0024 2.6959 5.6523 51.7608 2.9418 3.1320 24.7087 55.4087 8.6612 16.4272 1.6351 4.9503 10.9293 1.1721 4.2030 4.1391 1.1709 0.7170 45.4021 0.5669 0.5219 19.3286 2.4619 51.8571 9.3575 35.6389 0.1068 12.6317 70.4693 2.1622 0.1038 42.9846 77.1857 28.0933 6.1715 182.4647 62.0197 117.3497 8.5256 79.8374 64.1403 3.9054 28.5870 51.4211 9.7453 5.6820 119.1108 16.6648 15.9564 7.2265 9.5910 19.4208 8.3958 13.8394 26.4719 30.1993 78.4338 22.3245 17.2363 46.5414 12.2011 6.0006 24.9833 167.7034 24.2315 71.0004 27.7417 32.8724 49.1366 44.4783 1.6955 25.3150 69.0611 54.5682 17.8455 27.4028 3.0844 2.8742 8.8336 20.9527 1.9716 23.3873 12.5872 9.7137 4.2853
temp: 298.150 k
press: 1.00000 atm
elementType: 16 8 7 6 6 6 6 6 6 6 6 6 6 6 6 6 6 6 6 6 6 1 1 1 1 1 1 1 1 1 1 1 1 1 1 1 1 1 1 1 1 1
symmnumber: 1
zpe: 903826.6 jmol-1
zpe.correction: 0.344249 hartree
zpe.thermalcorrener: 0.365059 hartree
zpe.thermalcorrenthalpy: 0.366003 hartree
zpe.thermalcorrgfe: 0.293487 hartree
zpe.sumelectzpe: -1224.999659 hartree
zpe.sumelectthermal: -1224.978850 hartree
zpe.sumelectthermalent: -1224.977906 hartree
zpe.sumelectthermalfe: -1225.050422 hartree
dipole: -0.4513 5.7697 -0.8783
dipole: 5.8536
quadrupole: -117.9632 -137.5381 -126.3998
quadrupole: -6.1460 1.5115 -5.9732
quadrupole: 9.3371 -10.2377 0.9006 -6.1460 1.5115 -5.9732
hfenergy: -1225.3439089 hartree
pointgroup: C01 [X(C18H21N1O1S1)]
dipole: -0.0904178 -2.2972229 0.1351652 debye
polarizability: 273.7787434|15.1353527|256.9227768|14.8295693|-2.2025193|162.1678886 unknown
InChI: InChI=1S/C18H21NOS/c1-14(2)13-19(16-7-5-4-6-8-16)18(21)15-9-11-17(20-3)12-10-15/h4-12,14H,13H2,1-3H3
charge 0 multiplicity 1
42 atoms
S  0.773367 3.265127 0.773534
O  -5.024579 0.135148 -0.198333
N  1.473662 0.608766 0.64292
C  3.970727 1.032043 0.064118
C  2.840044 0.962356 1.136099
C  3.56249 1.86479 -1.172914
C  4.533865 -0.349646 -0.352584
C  1.282449 -0.751391 0.171519
C  0.476519 1.577594 0.557117
C  -0.933023 1.124671 0.347367
C  0.81196 -0.988405 -1.144426
C  1.601849 -1.84821 1.009316
C  -1.489693 0.039219 1.073245
C  -1.786665 1.853806 -0.528429
C  0.655149 -2.310332 -1.610832
C  1.451045 -3.168838 0.53402
C  0.976806 -3.407144 -0.777057
C  -2.847733 -0.317116 0.936476
C  -3.131767 1.494688 -0.697307
C  -3.670235 0.405526 0.036444
C  -5.637218 -0.967952 0.546625
H  4.790268 1.575744 0.582777
H  3.124316 0.227959 1.914021
H  2.73527 1.953782 1.609521
H  2.778441 1.345154 -1.754429
H  3.163145 2.850747 -0.879384
H  4.431645 2.013399 -1.840032
H  5.438035 -0.216821 -0.975926
H  4.815475 -0.957589 0.528021
H  3.802616 -0.928245 -0.943192
H  0.570447 -0.139434 -1.791248
H  1.955856 -1.671984 2.03058
H  -0.866136 -0.52093 1.776641
H  -1.374895 2.71563 -1.062983
H  0.289135 -2.482865 -2.628887
H  1.698817 -4.010688 1.190114
H  0.860617 -4.432577 -1.144003
H  -3.246625 -1.145309 1.529405
H  -3.788106 2.045136 -1.377726
H  -6.682373 -0.998554 0.205807
H  -5.605669 -0.782198 1.637669
H  -5.141295 -1.931257 0.31844
