program: Gaussian 09
title: 000292051
version: EM64L-G09RevD.01
frameworkgroup: C1[X(C13H9ClF3N3O4S)]
method: RPBEPBE
basis: SDD
operation: Freq
keyword: #p
keyword: freq=noraman
keyword: PBEPBE/SDD
title: #p freq=noraman PBEPBE/SDD
converged: YES YES NO NO
title: Mulliken charges:
elementType: Cl S F F F O O O O N N N C C C C C C C C C C C C C H H H H H H H H H
charge: 0.000753 0.808674 -0.152702 -0.162064 -0.166283 -0.549037 -0.562797 -0.194251 -0.207099 -0.300404 -0.351235 0.026617 -0.107100 0.631373 -0.293151 0.351035 -0.422330 -0.237864 0.392432 -0.356536 -0.381985 -0.171187 -0.185549 -0.351857 0.260354 0.290813 0.354087 0.325199 0.322806 0.297142 0.278505 0.251993 0.269036 0.292612
chargesum: 0.00000
title: Mulliken charges with hydrogens summed into heavy atoms:
elementType: Cl S F F F O O O O N N N C C C C C C C C C C C C C
charge: 0.000753 0.808674 -0.152702 -0.162064 -0.166283 -0.549037 -0.562797 -0.194251 -0.207099 -0.009591 0.002852 0.026617 -0.107100 0.631373 0.032049 0.351035 -0.099523 0.059278 0.392432 -0.356536 -0.103480 0.080806 0.083487 -0.059246 0.260354
polarizability: 2.83481986e+02 -1.58643576e+01 2.72454125e+02 2.31051378e+01 -3.16976975e+01 1.59376162e+02
1716.lowfreq: -10.8320 -8.0827 -4.7569 -0.0022 0.0011 0.0020 7.7988 17.3154 22.8426
frequency: -4.8234 17.3005 22.8053 33.4542 37.9058 49.3778 63.4958 79.1126 81.9202 123.5632 135.7969 140.5682 142.5359 178.3433 194.5570 201.5212 216.4629 235.3459 258.6763 273.6230 282.4948 320.8500 339.7026 354.5444 365.0936 381.6596 395.4251 410.0943 425.8151 445.8801 454.9973 476.9609 502.7514 512.3559 517.3546 524.0431 602.3446 612.8270 634.1637 647.4408 665.7749 668.9045 682.7251 701.4375 710.9891 722.7738 742.0697 801.2027 818.0437 828.9986 842.7026 869.4459 880.6325 918.7285 925.3235 955.1014 960.6887 980.3943 983.5205 1005.6959 1011.3763 1023.7956 1045.5422 1068.4878 1076.5782 1097.6052 1150.1074 1166.7440 1185.3996 1202.8957 1215.0287 1262.1458 1267.7615 1293.2678 1338.5537 1372.3947 1394.9003 1401.8698 1421.4545 1438.5441 1443.7075 1471.0343 1547.0554 1584.6309 1597.6202 1603.0275 1607.6933 3151.6864 3167.4320 3173.0506 3174.4589 3175.0516 3188.6071 3192.7844 3293.2692 3378.2007
redmass: 12.9637 8.6120 11.4007 11.9902 11.4084 10.3074 14.8358 10.9591 11.7238 13.4350 8.0178 6.0225 7.1880 5.4680 8.3758 10.1434 9.1582 9.1646 15.9693 5.2971 10.5682 7.1055 6.5282 8.6117 6.9061 7.9147 8.8403 5.9141 3.6292 4.2560 8.4497 4.9155 7.8139 6.9527 6.6852 7.2920 2.7633 7.0058 7.1312 9.0923 2.5510 3.4295 7.5337 3.9725 6.0493 3.5166 11.6745 9.4445 1.4095 1.3568 1.2465 11.4150 4.7054 1.5091 1.4807 1.3876 1.4896 5.7968 6.2662 1.3689 5.8728 6.5091 1.9102 3.5304 1.8281 2.7366 1.7504 1.1301 1.8694 2.2717 8.4440 1.3487 1.9083 2.9049 1.4893 8.6336 7.9671 8.9320 3.0028 3.0029 2.3932 2.6838 1.8839 7.0467 7.7194 4.9610 5.3306 1.0886 1.0941 1.0919 1.0921 1.0899 1.0969 1.0974 1.0762 1.0774
irintensity: 0.4734 2.2839 0.4711 0.2234 1.2831 3.2423 0.3615 0.5078 5.1707 17.3576 2.2099 2.2798 2.6585 2.9000 13.9408 3.4303 1.9817 8.5865 1.3138 27.3778 0.6085 2.2192 11.7193 6.2842 18.6659 9.9003 2.4894 24.7859 12.3142 5.8068 35.6114 9.1874 17.4779 12.9755 20.1165 11.4313 31.0533 8.7392 3.5463 7.2076 113.5385 6.1376 7.8601 25.9796 7.5917 8.7616 75.7997 12.6820 34.5078 65.2231 37.1431 65.0613 18.9283 53.3661 4.6715 7.2372 19.9915 14.8310 162.5717 0.4761 180.6597 23.0262 11.8831 112.4695 33.8461 12.3016 21.2446 13.2931 57.5523 133.4841 178.2202 3.5917 106.8349 197.8689 13.8344 94.1412 1.3918 0.8795 55.5744 54.5871 27.4510 22.8055 85.7487 8.5850 2.5747 20.9890 36.6526 3.4035 8.9094 11.3999 2.4201 1.4518 2.6501 0.5682 17.9132 106.2938
temp: 298.150 k
press: 1.00000 atm
elementType: 17 16 9 9 9 8 8 8 8 7 7 7 6 6 6 6 6 6 6 6 6 6 6 6 6 1 1 1 1 1 1 1 1 1
symmnumber: 1
zpe: 553524.6 jmol-1
zpe.correction: 0.210826 hartree
zpe.thermalcorrener: 0.233982 hartree
zpe.thermalcorrenthalpy: 0.234926 hartree
zpe.thermalcorrgfe: 0.155447 hartree
zpe.sumelectzpe: -2121.513169 hartree
zpe.sumelectthermal: -2121.490013 hartree
zpe.sumelectthermalent: -2121.489069 hartree
zpe.sumelectthermalfe: -2121.568548 hartree
dipole: -2.4143 -0.7276 1.9072
dipole: 3.1616
quadrupole: -131.0732 -182.8528 -162.6199
quadrupole: -4.6982 6.2073 -9.2643
quadrupole: 27.7755 -24.0042 -3.7713 -4.6982 6.2073 -9.2643
hfenergy: -2121.7239949 hartree
pointgroup: C01 [X(C13H9Cl1F3N3O4S1)]
dipole: 0.4551421 1.143484 -0.1801919 debye
polarizability: 232.571993|-41.0144992|232.4435071|-62.0646557|-29.4785901|250.2967727 unknown
InChI: InChI=1S/C7H5ClF3N2.C6H4NO4S/c8-5-2-1-4(7(9,10)11)3-6(5)13-12;8-7(9)5-2-1-3-6(4-5)12(10)11/h1-3,12-13H;1-4H
charge 0 multiplicity 1
34 atoms
Cl -0.086351 2.149945 -4.080058
S  -2.280528 1.830031 0.481907
F  3.966813 -1.64483 -0.128573
F  4.013496 0.322694 1.000673
F  2.313459 -1.128715 1.340995
O  -3.608894 2.470615 1.220677
O  -2.307705 1.47063 -1.147762
O  -0.138884 -4.24248 1.159633
O  0.248842 -2.802611 -0.565684
N  -0.264933 3.211633 0.166385
N  -0.064979 2.884818 -1.123219
N  -0.269938 -3.099735 0.578629
C  -2.004325 0.145188 1.316473
C  0.789644 1.80342 -1.441839
C  -1.260927 -0.817536 0.624486
C  2.372861 0.073106 -0.772538
C  1.560521 1.174015 -0.437249
C  -2.564073 -0.071461 2.587213
C  -1.066099 -2.053428 1.273602
C  0.879317 1.330131 -2.778345
C  2.439173 -0.408284 -2.099362
C  -2.355869 -1.329845 3.202251
C  1.690395 0.233929 -3.109255
C  -1.600267 -2.328139 2.552043
C  3.156433 -0.589519 0.327124
H  -0.86559 4.066693 0.201134
H  -0.678134 3.210161 -1.889075
H  -0.869397 -0.643587 -0.381773
H  1.495395 1.556754 0.585097
H  -3.162067 0.71407 3.061301
H  3.057386 -1.275818 -2.342136
H  -2.783436 -1.528078 4.1898
H  1.72921 -0.123221 -4.141447
H  -1.420247 -3.304651 3.008994
