program: Gaussian 09
title: 000292005
version: EM64L-G09RevD.01
frameworkgroup: C1[X(C16H17Cl2N3)]
method: RPBEPBE
basis: SDD
operation: Freq
keyword: #p
keyword: freq=noraman
keyword: PBEPBE/SDD
title: #p freq=noraman PBEPBE/SDD
converged: YES YES NO NO
title: Mulliken charges:
elementType: Cl Cl N N N C C C C C C C C C C C C C C C C H H H H H H H H H H H H H H H H H
charge: -0.031703 -0.069116 -0.156470 -0.056692 -0.116484 0.449027 0.450348 0.473631 -0.221408 -0.603331 -0.594140 -0.819532 -0.790752 -0.642176 -0.643099 0.313973 -0.303049 -0.244627 -0.078859 -0.197136 -0.244236 0.248906 0.245659 0.242319 0.211810 0.243061 0.205709 0.251596 0.250484 0.241790 0.221379 0.241275 0.220923 0.241869 0.242545 0.298691 0.257919 0.259895
chargesum: 0.00000
title: Mulliken charges with hydrogens summed into heavy atoms:
elementType: Cl Cl N N N C C C C C C C C C C C C C C C C
charge: -0.031703 -0.069116 -0.156470 -0.056692 -0.116484 0.449027 0.450348 0.473631 -0.221408 -0.354425 -0.348481 -0.122341 -0.082963 0.062268 0.062238 0.313973 -0.303049 0.054064 -0.078859 0.060783 0.015659
polarizability: 5.39070682e+02 -4.64732890e+00 2.46747852e+02 1.27665318e-01 1.34899146e-01 9.83437708e+01
1716.lowfreq: -6.6035 -3.4836 0.0013 0.0021 0.0024 4.6326 14.6591 29.6686 43.0101
frequency: 14.6277 29.6658 42.9954 69.2945 84.1689 93.9071 110.1556 130.2978 138.7334 145.6950 149.8728 163.7412 182.5565 200.6946 207.1057 244.0702 246.5656 266.0458 273.5350 306.5896 307.5245 314.5655 342.2119 379.6580 400.5538 406.2000 457.3355 461.3434 507.6845 516.1671 533.9183 543.0785 569.0212 573.8443 601.6783 628.8099 628.8615 696.3864 716.4696 761.9678 800.0839 809.0146 841.2690 860.3472 870.4244 891.4045 909.9990 935.6668 965.3746 972.4315 1015.7131 1033.1701 1037.6081 1046.6941 1052.4124 1056.7434 1062.5974 1103.4626 1112.6799 1122.0228 1147.9486 1168.9603 1216.2422 1238.5923 1256.0685 1256.8669 1271.3477 1323.9774 1354.0996 1367.2882 1380.2502 1390.2190 1398.2974 1400.8295 1431.0608 1433.0573 1440.0899 1443.8448 1445.6593 1455.3723 1462.0938 1466.1134 1478.5478 1478.6193 1490.7137 1499.4012 1518.3259 1538.7441 1548.4765 1584.5397 1628.1858 2953.7285 2960.2395 2983.7433 2990.8822 3024.3114 3027.1093 3073.9339 3078.6191 3083.7281 3088.5082 3102.3271 3112.5673 3152.3842 3159.4062 3163.7752 3172.2776 3183.7859
redmass: 4.6561 4.4721 7.8315 2.4482 4.6356 8.0836 1.8740 7.8060 1.2817 1.3644 8.4159 1.2290 2.4659 2.8628 3.2930 2.2890 7.4676 1.8380 3.3325 3.2024 10.8036 4.5855 4.7482 3.3539 4.6679 3.9356 5.6069 3.5013 5.7537 6.6312 3.0366 4.7723 3.5322 4.9249 5.8086 3.2546 4.3164 6.8871 3.9709 3.1404 1.3498 6.0526 1.2959 1.7870 5.5527 6.9582 1.4337 1.3411 2.1195 2.9852 6.1520 1.7144 1.5959 1.6017 1.7357 1.5510 1.8501 1.2368 1.3312 2.1492 1.7284 2.1106 2.0326 2.3396 3.8953 2.3606 1.5131 5.9960 4.7745 3.3524 4.1504 6.7307 1.3106 1.3024 1.5314 1.3796 1.9005 1.0462 1.5209 1.0478 1.1789 1.0394 1.2208 1.1250 1.2569 1.4450 1.5912 6.9181 6.9100 8.7377 5.6854 1.0365 1.0389 1.0371 1.0362 1.0997 1.1029 1.0947 1.0968 1.1009 1.1005 1.0972 1.0951 1.0900 1.0905 1.0886 1.0910 1.0976
irintensity: 0.0667 0.9595 0.8612 0.0001 1.1242 0.0028 6.2517 0.1581 2.4865 0.1635 0.2707 0.2796 0.9367 0.1138 0.5382 0.0826 1.5338 0.2552 1.4597 3.5887 0.1497 0.3430 4.0810 0.5818 1.0431 1.5750 26.6483 15.6737 15.5455 16.2369 0.1794 0.4441 1.6640 3.8796 21.8246 0.8539 3.0602 18.7655 0.5698 4.1907 42.8759 16.6445 0.0195 43.2099 109.5854 28.1630 18.9214 2.0609 12.9226 1.0132 89.1883 3.6752 5.7559 13.9830 1.1982 28.1841 21.5391 0.1551 1.0769 19.5208 44.6654 8.6781 8.5335 4.4637 14.4127 3.1615 26.7110 978.9577 9.0905 194.1157 4.4397 36.4263 12.4133 17.2229 64.4949 15.9259 32.5473 12.5303 31.4483 13.1795 30.3385 0.0086 10.9801 17.0490 0.5573 2.9846 247.4994 41.6961 56.0315 28.3177 654.3260 76.1196 186.2974 26.9365 23.3073 3.6134 66.5556 7.4212 12.6137 28.6980 26.3503 3.3831 48.5940 21.6965 22.1301 2.4900 6.5061 4.1048
temp: 298.150 k
press: 1.00000 atm
elementType: 17 17 7 7 7 6 6 6 6 6 6 6 6 6 6 6 6 6 6 6 6 1 1 1 1 1 1 1 1 1 1 1 1 1 1 1 1 1
symmnumber: 1
zpe: 770226.9 jmol-1
zpe.correction: 0.293364 hartree
zpe.thermalcorrener: 0.314830 hartree
zpe.thermalcorrenthalpy: 0.315774 hartree
zpe.thermalcorrgfe: 0.241306 hartree
zpe.sumelectzpe: -1702.715876 hartree
zpe.sumelectthermal: -1702.694410 hartree
zpe.sumelectthermalent: -1702.693466 hartree
zpe.sumelectthermalfe: -1702.767935 hartree
dipole: 7.3157 -0.2163 0.0016
dipole: 7.3189
quadrupole: -90.0177 -137.0766 -142.3536
quadrupole: -7.3922 0.0814 0.0698
quadrupole: 33.1316 -13.9273 -19.2043 -7.3922 0.0814 0.0698
hfenergy: -1703.0092404 hartree
pointgroup: C01 [X(C16H17Cl2N3)]
dipole: 2.8754476 0.1242381 0.0880704 debye
polarizability: 538.5231576|8.3333902|246.1428627|12.6806046|11.0219662|99.496285 unknown
InChI: InChI=1S/C16H17Cl2N3/c1-10-7-13(21(3)4)8-11(2)16(10)20-19-15-9-12(17)5-6-14(15)18/h5-9H,1-4H3
charge 0 multiplicity 1
38 atoms
Cl -2.885487 -3.291038 -0.33347
Cl -5.240486 2.686063 0.000889
N  5.197485 0.22706 0.129289
N  -0.460989 0.306995 -0.021389
N  -1.210445 -0.774212 -0.128752
C  3.807063 0.206269 0.08713
C  1.646152 1.404132 0.125243
C  1.68608 -1.083211 -0.078062
C  0.933494 0.152376 0.002935
C  3.045353 1.417221 0.165583
C  3.088683 -1.026292 -0.034731
C  0.888758 2.716753 0.211886
C  1.035431 -2.444715 -0.208448
C  5.917703 1.505191 0.242536
C  5.96294 -1.027542 0.054849
C  -2.611221 -0.492441 -0.143114
C  -3.515567 -1.586569 -0.237752
C  -3.165198 0.821333 -0.06964
C  -4.551297 0.992545 -0.092823
C  -4.910791 -1.398672 -0.259327
C  -5.447875 -0.094275 -0.18684
H  3.55251 2.380882 0.261483
H  3.637035 -1.970536 -0.09908
H  0.265957 2.877251 -0.685558
H  1.587361 3.565386 0.312724
H  0.197976 2.722436 1.072831
H  1.804476 -3.236875 -0.248997
H  0.343902 -2.645703 0.627964
H  0.398761 -2.505193 -1.108297
H  5.690716 2.177848 -0.607948
H  7.001965 1.314962 0.24506
H  5.661712 2.037399 1.180077
H  7.038618 -0.804129 0.124453
H  5.784784 -1.559812 -0.900493
H  5.701953 -1.713263 0.884667
H  -2.468583 1.660827 0.003639
H  -5.575989 -2.263478 -0.33238
H  -6.528942 0.066623 -0.203336
