program: Gaussian 09
title: 000291993
version: EM64L-G09RevD.01
frameworkgroup: C1[X(C14H11NO2)]
method: RPBEPBE
basis: SDD
operation: Freq
keyword: #p
keyword: freq=noraman
keyword: PBEPBE/SDD
title: #p freq=noraman PBEPBE/SDD
converged: NO YES NO NO
title: Mulliken charges:
elementType: O O N C C C C C C C C C C C C C C H H H H H H H H H H H
charge: -0.145928 -0.149437 -0.092924 0.181960 0.211497 -0.407574 -0.506345 0.483066 -0.348774 -0.364044 -0.400607 0.266969 -0.375843 -0.349934 -0.202404 -0.219367 -0.248356 0.243583 0.244253 0.291301 0.259112 0.236603 0.220490 0.250586 0.239107 0.228080 0.225610 0.229323
chargesum: 0.00000
title: Mulliken charges with hydrogens summed into heavy atoms:
elementType: O O N C C C C C C C C C C C C C C
charge: -0.145928 -0.149437 -0.092924 0.181960 0.211497 0.080261 -0.215044 0.483066 -0.089662 -0.127441 -0.180116 0.266969 -0.125257 -0.110826 0.025676 0.006243 -0.019033
polarizability: 3.52894046e+02 6.87783553e+00 1.61780650e+02 -9.91789118e-01 5.28446198e+00 7.76331714e+01
1716.lowfreq: -76.4956 -4.7559 -0.0004 -0.0003 -0.0002 1.5005 10.7825 32.9262 47.1648
frequency: -76.4904 32.8821 47.1568 55.5804 116.9947 151.7886 187.3835 209.6117 248.6331 288.3899 355.9384 391.8987 408.7337 420.2326 473.4235 485.3365 522.4655 568.8292 570.6712 612.3537 621.8491 681.9747 694.7139 711.4155 729.1448 765.5172 782.2223 806.6926 815.2646 833.9201 839.7878 869.5446 910.1893 926.5363 943.6109 952.8342 968.8647 979.1305 987.5038 990.1765 1011.0212 1020.7095 1080.2809 1105.0774 1110.2833 1138.6794 1167.8510 1173.4166 1189.5276 1209.6055 1249.0483 1267.1869 1294.0983 1308.1474 1353.8980 1377.4668 1397.3812 1438.0804 1452.5394 1458.7000 1469.7961 1479.2184 1574.7204 1578.0782 1591.2044 1614.8323 1619.0285 2950.8977 2975.7646 3037.1433 3122.8603 3131.5077 3132.6626 3143.4673 3156.0814 3157.2019 3168.7370 3183.8063
redmass: 4.3648 4.1858 5.8365 5.4924 6.2638 5.9847 3.4201 3.9090 5.8975 5.3019 4.2739 4.6560 2.9269 2.9953 6.0235 6.0328 3.4267 4.0615 5.0776 6.4558 7.2413 8.5870 1.8905 3.5498 10.1845 2.1065 3.7954 6.2324 1.3774 3.3978 1.4583 8.6992 1.4481 1.3486 1.3598 2.9780 1.4017 2.1344 2.6671 1.3834 1.5427 2.1349 1.5321 2.9857 1.0828 1.7399 1.1733 1.2529 1.7183 2.0717 1.8898 1.9611 1.3012 1.3846 2.5752 6.2460 2.6889 2.4129 4.8654 2.3538 1.1882 2.6020 6.9058 6.1827 7.0006 6.4630 6.9465 1.0862 1.0544 1.1099 1.0850 1.0874 1.0901 1.0932 1.0957 1.0929 1.1010 1.0952
irintensity: 5.4120 0.4259 0.0523 0.5394 4.4618 0.7665 7.0719 5.9960 3.6153 3.7138 2.5575 3.3756 1.5215 6.1596 13.9893 14.3763 7.7131 6.9961 7.8192 0.0906 6.5748 1.8608 39.6272 20.0417 6.7129 49.2216 14.4032 9.2727 46.4390 7.2842 0.4910 14.4570 6.9927 8.8622 5.3224 4.6766 1.0852 16.8855 8.1726 0.3081 1.2972 8.7997 11.3155 109.3359 0.3793 17.5542 1.6728 3.1868 7.1844 15.0627 82.4960 26.6067 2.0286 0.4279 18.8141 0.6110 9.5702 6.0475 106.2153 7.8206 5.6391 55.4404 103.9523 59.3959 59.8232 36.6080 4.4149 54.4803 36.0876 16.8268 6.8406 1.4196 7.3321 22.1162 31.8432 0.9560 27.0625 4.6997
temp: 298.150 k
press: 1.00000 atm
elementType: 8 8 7 6 6 6 6 6 6 6 6 6 6 6 6 6 6 1 1 1 1 1 1 1 1 1 1 1
symmnumber: 1
zpe: 555361.6 jmol-1
zpe.correction: 0.211526 hartree
zpe.thermalcorrener: 0.224565 hartree
zpe.thermalcorrenthalpy: 0.225509 hartree
zpe.thermalcorrgfe: 0.170335 hartree
zpe.sumelectzpe: -744.010756 hartree
zpe.sumelectthermal: -743.997717 hartree
zpe.sumelectthermalent: -743.996773 hartree
zpe.sumelectthermalfe: -744.051946 hartree
dipole: -2.4170 0.6757 -0.0013
dipole: 2.5096
quadrupole: -110.0442 -83.7354 -101.1752
quadrupole: -2.1059 0.0981 1.2034
quadrupole: -11.7260 14.5829 -2.8569 -2.1059 0.0981 1.2034
hfenergy: -744.2222817 hartree
pointgroup: C01 [X(C14H11N1O2)]
dipole: 0.9485727 -0.2415156 0.1294945 debye
polarizability: 352.9936594|3.8318265|136.0854072|-3.7811236|-39.0423936|103.2288009 unknown
InChI: InChI=1S/C14H11NO2/c1-2-4-13(5-3-1)15-9-11-6-7-14-12(8-11)10-16-17-14/h1-9H,10H2
charge 0 multiplicity 1
28 atoms
O  -5.018059 -0.267375 0.150451
O  -5.202098 1.19664 -0.385547
N  1.395298 0.245359 -0.204537
C  -2.876782 0.646043 -0.216949
C  -3.639379 -0.474564 0.191274
C  -3.826355 1.767489 -0.584099
C  -1.483287 0.581633 -0.223428
C  -0.841981 -0.627944 0.185473
C  -3.044637 -1.684168 0.601935
C  -1.634966 -1.73867 0.590544
C  0.621978 -0.73762 0.194304
C  2.810748 0.158016 -0.122147
C  3.568062 0.830202 -1.120839
C  3.498864 -0.508556 0.934784
C  4.976592 0.79869 -1.091224
C  4.908754 -0.521689 0.966535
C  5.655087 0.121927 -0.048813
H  -3.725122 2.646832 0.080657
H  -3.742782 2.06897 -1.645588
H  -0.852679 1.421947 -0.530412
H  -3.65456 -2.53574 0.912148
H  -1.138031 -2.665323 0.902194
H  1.031525 -1.71387 0.531168
H  3.027383 1.360949 -1.91115
H  2.928427 -0.976271 1.746123
H  5.547755 1.30992 -1.874205
H  5.427487 -1.024697 1.790616
H  6.750059 0.10987 -0.020169
