program: Gaussian 09
title: 000291985
version: EM64L-G09RevD.01
frameworkgroup: C1[X(C11H14O3)]
method: RPBEPBE
basis: SDD
operation: Freq
keyword: #pfreq=noraman
keyword: PBEPBE/SDD
title: #p freq=noraman PBEPBE/SDD
converged: YES YES NO NO
title: Mulliken charges:
elementType: O O O C C C C C C C C C C C H H H H H H H H H H H H H H
charge: -0.267933 -0.415558 -0.233105 -0.562768 0.497231 -0.484533 -0.374473 -0.425921 0.333774 -0.373991 -0.355792 0.186812 -0.243906 -0.685240 0.228886 0.231565 0.265593 0.264587 0.232831 0.231156 0.247826 0.243043 0.206377 0.207397 0.206546 0.232265 0.231897 0.375431
chargesum: 0.00000
title: Mulliken charges with hydrogens summed into heavy atoms:
elementType: O O O C C C C C C C C C C C
charge: -0.267933 -0.040126 -0.233105 -0.102317 0.497231 0.045648 -0.141642 -0.194765 0.333774 -0.126165 -0.112749 0.186812 0.169868 -0.014532
polarizability: 1.92944888e+02 -1.53088480e+00 1.11668010e+02 9.87905440e+00 1.22612698e+00 8.68013495e+01
1716.lowfreq: -16.3973 -2.7834 -0.0005 -0.0002 0.0007 6.0285 15.0143 22.4358 37.6048
frequency: 14.8716 21.1814 37.3518 68.4330 78.5957 114.1093 139.4229 165.1861 190.3332 240.8493 297.8145 317.9629 359.9711 412.7754 420.2585 445.3343 503.6123 529.1701 541.6822 595.2082 633.4953 638.8311 722.3317 741.8712 775.0234 806.2780 812.5257 831.1072 832.5650 883.8121 903.2274 938.6478 962.6036 998.3394 1005.0889 1019.0245 1037.7623 1077.1515 1111.2862 1117.5065 1135.1445 1151.5143 1177.8963 1215.4821 1225.3510 1237.8510 1260.6379 1266.4608 1300.4366 1307.9936 1362.2246 1365.4260 1382.7034 1399.0692 1418.0643 1437.5375 1460.2336 1474.0470 1476.8406 1487.3599 1504.4222 1583.4357 1625.3700 1666.5651 2951.9773 2997.0940 2997.6343 3007.3166 3009.3075 3042.6243 3070.4207 3094.2872 3106.1722 3117.3575 3120.3632 3159.6906 3163.9259 3509.9243
redmass: 7.7721 4.1260 4.1479 2.2444 5.0643 1.7147 3.2405 6.4169 6.2832 1.2107 2.8547 4.0641 4.6574 2.9584 3.8960 4.3612 1.7644 2.9965 3.8569 4.6712 6.6668 1.3258 3.5883 4.0549 1.3868 1.3972 4.0162 1.5859 1.1303 3.1878 3.2633 1.4223 1.3560 2.0103 2.4607 3.5745 2.8662 2.4706 1.5716 1.7860 1.4367 1.1708 1.2453 2.0034 4.4592 1.4327 1.1439 1.1776 1.7050 1.3352 1.5318 1.7223 3.1739 1.3092 3.4120 1.0843 1.0400 1.0982 1.0801 1.1541 2.1952 7.0174 6.5125 8.2270 1.0553 1.0364 1.0612 1.0603 1.1074 1.0985 1.1024 1.0989 1.1013 1.0896 1.0892 1.0938 1.0950 1.0639
irintensity: 1.2189 0.2948 0.2576 0.4805 1.6208 2.5467 1.2187 2.0342 2.0659 0.9503 0.2825 0.7366 1.3259 0.1886 0.8277 15.9627 27.3071 54.6894 20.6982 7.1633 0.2549 128.1739 1.5143 5.0440 8.3383 30.7774 5.4566 36.4326 1.5588 6.5241 32.9024 0.0304 0.6312 3.6239 4.1735 215.6416 63.3812 99.9853 3.8945 10.6121 4.3863 6.0234 75.6495 66.2756 173.9194 4.8755 0.0407 0.4358 33.8548 7.7452 32.2848 33.5913 11.4049 37.2386 1.2968 27.1719 11.8103 19.0059 28.8682 40.1468 98.5999 9.5467 40.8956 225.3540 40.5819 29.2508 4.2825 21.7299 40.1780 0.0104 18.1470 29.6056 35.1496 15.4755 22.4662 17.8032 4.2071 16.6856
temp: 298.150 k
press: 1.00000 atm
elementType: 8 8 8 6 6 6 6 6 6 6 6 6 6 6 1 1 1 1 1 1 1 1 1 1 1 1 1 1
symmnumber: 1
zpe: 595816.6 jmol-1
zpe.correction: 0.226935 hartree
zpe.thermalcorrener: 0.241390 hartree
zpe.thermalcorrenthalpy: 0.242334 hartree
zpe.thermalcorrgfe: 0.182198 hartree
zpe.sumelectzpe: -652.190006 hartree
zpe.sumelectthermal: -652.175551 hartree
zpe.sumelectthermalent: -652.174607 hartree
zpe.sumelectthermalfe: -652.234742 hartree
dipole: 1.5889 -1.0823 1.4475
dipole: 2.4065
quadrupole: -73.0496 -77.6531 -89.1955
quadrupole: -8.4806 -5.9335 -2.1640
quadrupole: 6.9164 2.3130 -9.2294 -8.4806 -5.9335 -2.1640
hfenergy: -652.4169406 hartree
pointgroup: C01 [X(C11H14O3)]
dipole: 0.5977993 -0.7330491 0.0412903 debye
polarizability: 191.9209122|-12.4280566|96.280087|7.2677439|11.485083|103.2132481 unknown
InChI: InChI=1S/C11H14O3/c1-2-14-10-6-3-9(4-7-10)5-8-11(12)13/h3-4,6-7,12H,2,5,8H2,1H3
charge 0 multiplicity 1
28 atoms
O  3.563282 0.008796 0.619708
O  -5.126558 -0.953963 1.011605
O  -4.951026 0.452609 -0.827064
C  -2.053285 0.559452 -0.6104
C  -0.564927 0.411566 -0.330185
C  -2.902751 -0.315277 0.344065
C  0.055097 1.139497 0.722275
C  0.240572 -0.475977 -1.081699
C  2.21082 0.08824 0.249753
C  1.422403 0.986038 1.013482
C  1.617625 -0.646949 -0.806273
C  -4.390718 -0.200897 0.080092
C  4.433862 -0.901825 -0.148889
C  5.829822 -0.795087 0.459358
H  -2.368334 1.61369 -0.499806
H  -2.283606 0.275286 -1.652978
H  -2.618665 -1.381795 0.254675
H  -2.715382 -0.048774 1.401498
H  -0.540669 1.845048 1.31519
H  -0.210245 -1.044047 -1.905171
H  1.903297 1.550649 1.818321
H  2.206118 -1.339568 -1.415122
H  4.041389 -1.937484 -0.076839
H  4.435303 -0.598573 -1.216473
H  6.531143 -1.458972 -0.078197
H  6.205162 0.240185 0.391496
H  5.813974 -1.089019 1.522677
H  -6.097405 -0.864351 0.807902
