program: Gaussian 09
title: 000291988
version: EM64L-G09RevD.01
frameworkgroup: C1[X(C10H16O4)]
method: RPBEPBE
basis: SDD
operation: Freq
keyword: #pfreq=noraman
keyword: PBEPBE/SDD
title: #p freq=noraman PBEPBE/SDD
converged: YES YES NO NO
title: Mulliken charges:
elementType: O O O O C C C C C C C C C C H H H H H H H H H H H H H H H H
charge: -0.283500 -0.231736 -0.280402 -0.256467 -0.148970 -0.474923 -0.715055 -0.228518 0.248135 0.214378 -0.776242 0.164254 -0.499261 -0.505720 0.248216 0.234320 0.212099 0.232536 0.232458 0.221035 0.260042 0.226757 0.237830 0.240208 0.244558 0.228941 0.242457 0.242388 0.240816 0.229365
chargesum: 0.00000
title: Mulliken charges with hydrogens summed into heavy atoms:
elementType: O O O O C C C C C C C C C C
charge: -0.283500 -0.231736 -0.280402 -0.256467 0.099246 -0.028504 -0.029026 0.031524 0.248135 0.214378 -0.071447 0.164254 0.216695 0.206850
polarizability: 1.51844957e+02 -1.82795126e+01 1.17184732e+02 -3.95458379e+00 -7.74512111e+00 1.02510597e+02
1716.lowfreq: -15.1873 -7.4215 -4.9340 -0.0008 -0.0005 0.0008 15.2541 26.3975 35.8615
frequency: 14.3167 26.1827 35.7779 54.4130 73.0662 77.9713 100.9011 115.2035 122.4595 152.5249 169.2036 192.1413 225.7473 236.3185 247.9420 290.5285 314.9163 328.4540 335.5788 414.8570 459.7107 502.7357 508.5244 589.0787 643.9426 699.7727 713.8152 762.5901 769.0857 864.5006 902.7880 923.9706 941.4517 957.1570 982.3259 1023.7531 1046.8698 1059.6870 1072.7652 1075.7945 1111.3848 1113.6797 1137.7901 1147.2370 1149.8445 1176.1584 1221.6136 1249.5092 1280.5356 1310.4884 1324.8296 1366.1671 1384.6843 1404.9174 1421.6317 1422.2012 1450.1592 1450.2923 1454.8771 1460.3957 1463.4510 1464.0433 1470.5979 1477.2232 1483.0345 1605.4202 1642.6359 1667.1250 2972.8454 2986.7499 2991.8640 3002.4148 3004.3652 3028.3334 3069.7958 3071.7615 3084.7390 3094.9916 3098.1538 3102.9469 3106.2956 3109.0840 3145.6256 3147.1412
redmass: 4.0564 4.1878 3.8195 3.5676 1.3088 3.0051 1.1505 1.3748 2.0147 3.4372 3.5208 2.3779 1.1425 4.6300 3.1665 3.6271 3.8386 2.9738 3.7967 3.8193 3.6342 3.5698 3.5758 2.9939 3.5015 5.4818 5.8157 5.3643 4.9205 2.1810 2.0314 2.6791 2.5755 1.6844 2.2855 2.8399 1.4444 2.0779 2.2797 2.8093 1.2668 1.2674 1.9821 1.4443 1.6588 2.4056 2.6500 1.9855 1.3615 1.4510 1.2994 1.4729 1.1948 1.2808 1.1787 1.1893 1.0500 1.0510 1.0894 1.0488 1.0519 1.0519 1.0496 1.0673 1.0655 9.8276 9.5392 6.9783 1.0666 1.0348 1.0379 1.0296 1.0294 1.0848 1.0961 1.0930 1.1001 1.0978 1.0924 1.1042 1.1045 1.0989 1.1047 1.1049
irintensity: 1.6413 0.0368 0.5980 0.9650 0.2226 0.2853 0.7737 0.7573 3.2199 3.4537 1.5456 4.6331 1.0852 6.1270 3.6192 11.5295 15.5055 2.5004 0.8582 1.0560 7.3236 5.0870 2.6699 0.2029 6.7402 27.1582 4.1560 7.9744 5.1496 16.6668 4.3646 0.9045 9.3011 16.7443 3.0002 103.4430 2.2168 106.9004 48.8296 163.2551 0.0170 0.0296 32.1968 17.8334 45.5742 52.4545 167.6387 60.5467 19.8661 2.3745 4.5049 6.2656 7.9131 24.9994 15.0893 21.4902 19.8540 12.5766 5.4004 14.9068 9.8372 10.0558 14.1067 20.1682 13.5022 149.9203 185.6708 35.3266 25.5749 32.6743 16.1178 39.0787 29.9451 3.8725 16.4367 7.6211 28.3313 12.4560 21.8943 27.5014 29.6968 19.3302 18.1763 15.0264
temp: 298.150 k
press: 1.00000 atm
elementType: 8 8 8 8 6 6 6 6 6 6 6 6 6 6 1 1 1 1 1 1 1 1 1 1 1 1 1 1 1 1
symmnumber: 1
zpe: 642142.6 jmol-1
zpe.correction: 0.244579 hartree
zpe.thermalcorrener: 0.261955 hartree
zpe.thermalcorrenthalpy: 0.262899 hartree
zpe.thermalcorrgfe: 0.196302 hartree
zpe.sumelectzpe: -690.440520 hartree
zpe.sumelectthermal: -690.423144 hartree
zpe.sumelectthermalent: -690.422200 hartree
zpe.sumelectthermalfe: -690.488797 hartree
dipole: 0.6736 1.3420 -3.0416
dipole: 3.3921
quadrupole: -73.1108 -76.5885 -91.9879
quadrupole: -6.4461 -3.1225 1.0843
quadrupole: 7.4516 3.9739 -11.4255 -6.4461 -3.1225 1.0843
hfenergy: -690.685099 hartree
pointgroup: C01[X(C10H16O4)]
dipole: -0.2360147 0.3045746 1.277702 debye
polarizability: 151.6633582|19.0442236|114.1151368|-1.736565|9.383923|105.7617918 unknown
InChI: InChI=1S/C10H16O4/c1-7(9(11)13-3)5-6-8(2)10(12)14-4/h5,8H,6H2,1-4H3
charge 0 multiplicity 1
30 atoms
O  -2.311839 1.152979 0.658698
O  -2.349747 1.07861 -1.666257
O  3.409182 0.619956 0.283652
O  2.77873 -0.924294 -1.339882
C  -2.264712 -1.035702 -0.370723
C  -1.097958 -1.473246 0.57118
C  -3.630972 -1.529418 0.175145
C  0.263562 -1.185026 -0.009528
C  -2.300305 0.478804 -0.569466
C  1.225436 -0.34826 0.488472
C  1.110348 0.488053 1.74619
C  2.500964 -0.280516 -0.295852
C  -2.378526 2.631967 0.577244
C  4.703182 0.750801 -0.423768
H  -2.100041 -1.460282 -1.378335
H  -1.240723 -1.001379 1.557567
H  -1.196806 -2.569724 0.712623
H  -4.460042 -1.225381 -0.488059
H  -3.820285 -1.116008 1.181053
H  -3.633671 -2.632416 0.242549
H  0.511078 -1.710335 -0.944898
H  0.087648 0.46657 2.15419
H  1.812185 0.132089 2.522915
H  1.382932 1.537698 1.539643
H  -1.506388 3.023139 0.027058
H  -2.375316 2.972179 1.622303
H  -3.300909 2.944204 0.059191
H  4.541185 1.099864 -1.457607
H  5.223872 -0.22138 -0.452711
H  5.270536 1.488453 0.16121
