program: Gaussian 09
title: 000291977
version: EM64L-G09RevD.01
frameworkgroup: C1[X(C11H8ClNO3)]
method: RPBEPBE
basis: SDD
operation: Freq
keyword: #p
keyword: freq=noraman
keyword: PBEPBE/SDD
title: #p freq=noraman PBEPBE/SDD
converged: NO NO NO NO
title: Mulliken charges:
elementType: Cl O O O N C C C C C C C C C C C H H H H H H H H
charge: -0.034636 -0.215551 -0.381688 -0.283890 -0.389913 0.165254 0.191479 0.407653 0.067198 -0.388411 0.135386 -0.282013 -0.344638 -0.249740 -0.783182 0.111693 0.315535 0.292826 0.295572 0.263767 0.267401 0.192841 0.267401 0.379656
chargesum: 0.00000
title: Mulliken charges with hydrogens summed into heavy atoms:
elementType: Cl O O O N C C C C C C C C C C C
charge: -0.034636 -0.215551 -0.002032 -0.283890 -0.074379 0.165254 0.191479 0.407653 0.067198 -0.095585 0.135386 -0.282013 -0.049067 0.014027 -0.055539 0.111693
polarizability: 2.47180959e+02 2.66267856e+00 1.55057201e+02 5.81766834e-04 4.85074028e-04 5.99775443e+01
1716.lowfreq: -100.9711 -4.0661 -0.0015 0.0019 0.0028 7.7896 11.7917 36.3403 51.7742
frequency: -100.9646 36.0260 51.6846 82.8425 113.6506 142.9030 223.5223 234.8888 256.9431 264.7507 289.0344 300.5392 364.4581 399.1878 408.9332 454.0938 484.1845 523.0731 544.4483 575.8068 587.4405 600.9752 608.5796 636.5891 656.2048 690.6635 742.5495 744.0537 801.0052 834.4409 851.1398 895.9637 945.6163 964.6970 990.6855 1010.1937 1032.4143 1046.2070 1128.5077 1161.1215 1194.7998 1211.4185 1241.3442 1280.7629 1337.8605 1371.9989 1378.0320 1402.5689 1424.2171 1434.1467 1456.1416 1480.5531 1509.1805 1557.1632 1572.6853 1593.6533 1607.6309 1633.5794 2989.8384 3072.4376 3081.4466 3157.9000 3162.9913 3176.8467 3490.4103 3566.0398
redmass: 1.0404 9.3785 10.9877 6.8917 4.0260 9.4882 8.8739 4.9238 4.4088 11.8245 4.4790 5.5311 9.5675 6.6453 6.6651 3.4960 5.6611 3.8082 6.8413 4.9021 3.9146 6.0059 1.3329 1.3794 6.1412 3.6549 5.9917 6.3932 3.0467 4.7943 1.8494 5.7498 4.8372 1.3774 1.3415 1.7118 1.4847 3.1032 1.6731 2.2699 2.1758 1.7756 4.0709 1.7540 2.4044 3.9913 4.8786 2.3651 1.6619 2.8156 1.0416 1.2371 2.8324 9.8677 5.7381 7.0476 5.0896 6.8419 1.0373 1.0981 1.0976 1.0886 1.0942 1.0973 1.0636 1.0771
irintensity: 1.0107 2.3627 1.8552 3.4157 0.0404 0.0520 6.6386 0.0436 7.2240 0.6870 1.8281 9.5895 4.6781 13.6478 17.7262 2.7448 4.7470 4.8211 44.7807 16.1510 4.9166 2.4615 84.8295 101.4736 13.0944 46.4956 38.0400 5.0207 41.0006 20.2123 15.4429 12.1078 49.9059 8.8758 2.2182 12.7059 5.2948 382.4508 5.4968 49.9799 4.4289 0.7302 35.1565 3.5575 66.0937 33.8196 20.7710 6.7214 8.3676 107.5359 14.9687 11.2667 119.2915 148.5129 265.7560 195.8630 113.1115 271.6213 20.4848 7.0887 28.2264 2.3334 2.8069 2.6711 36.1019 73.3745
temp: 298.150 k
press: 1.00000 atm
elementType: 17 8 8 8 7 6 6 6 6 6 6 6 6 6 6 6 1 1 1 1 1 1 1 1
symmnumber: 1
zpe: 443011.1 jmol-1
zpe.correction: 0.168734 hartree
zpe.thermalcorrener: 0.181987 hartree
zpe.thermalcorrenthalpy: 0.182931 hartree
zpe.thermalcorrgfe: 0.127822 hartree
zpe.sumelectzpe: -1163.355553 hartree
zpe.sumelectthermal: -1163.342300 hartree
zpe.sumelectthermalent: -1163.341356 hartree
zpe.sumelectthermalfe: -1163.396465 hartree
dipole: 3.4356 4.3744 0.0006
dipole: 5.5623
quadrupole: -106.6356 -93.3378 -100.2914
quadrupole: 1.9777 0.0011 -0.0002
quadrupole: -6.5473 6.7504 -0.2031 1.9777 0.0011 -0.0002
hfenergy: -1163.5242873 hartree
pointgroup: C01 [X(C11H8Cl1N1O3)]
dipole: -1.3046133 1.7569249 0.0142916 debye
dipolederiv: -0.9032569 0.0523719 0.0006706 0.1045769 -0.1210428 -0.0005331 0.0011144 -0.0005286 -0.0589394 -0.5759567 0.1436249 0.001219 0.2983683 -0.9687188 -0.0052723 0.0024391 -0.0051689 -0.3258277 -0.6993318 0.4561497 0.0037743 0.6739767 -0.8288169 -0.003683 0.0055404 -0.0036661 -0.3859484 -1.1614861 -0.3093202 -0.0023927 -0.3756069 -0.8181833 -0.0037288 -0.0029466 -0.0037311 -0.3530085 -1.4278817 0.1491112 0.0014105 -0.0587461 -0.4588961 -0.0018193 -0.0002651 -0.0018375 -0.234173 0.6177025 0.3311737 0.0025601 0.4068734 0.2586791 0.0016483 0.003165 0.0016344 0.0480139 -0.4676502 0.2381738 0.0020306 0.032631 -0.1258873 -0.0010014 0.0003826 -0.0010413 -0.0026759 -0.4530865 -0.2927902 -0.0022554 -0.2480577 0.1256647 0.000991 -0.0018277 0.000951 0.0066892 0.9562469 -0.0653771 -0.0006693 -0.2071475 1.1407524 0.007922 -0.0018051 0.0078601 0.1652062 0.0358252 -0.1516787 -0.0012955 0.1593308 0.0073535 0.0009357 0.0012483 0.0009974 -0.1081281 -1.0535953 -0.1723003 -0.0012393 0.4740303 -0.6541371 -0.0046312 0.0039366 -0.0045407 -0.090811 1.3551238 -0.0520002 -0.000851 -0.0943569 0.2290991 0.0026763 -0.0012424 0.0026687 -0.0956152 1.1093379 -0.4364886 -0.0037263 -0.7851165 0.4089186 0.0033958 -0.0065733 0.0033353 0.0069864 -0.3587586 0.2081722 0.0017744 0.0737743 -0.0866672 0.0001423 0.0006988 0.000123 -0.1078342 -0.0086387 0.151491 0.0012811 0.1548343 -0.0434862 -0.0007052 0.0013352 -0.0006237 0.0408475 2.3453082 -0.0358839 -0.0006 -0.1595443 1.2506741 0.0083166 -0.0015558 0.0083003 0.2302461 0.2253366 0.0143094 0.0001263 -0.0688654 0.2120587 -0.0006702 -0.0005684 -0.0006786 0.2954899 0.1126757 0.0689181 0.0005823 -0.0140914 0.0474109 -0.0008917 -0.0001027 -0.0009006 0.1555174 0.1375139 -0.0451438 -0.0003596 -0.033796 0.0476615 -0.0009561 -0.0002506 -0.0009726 0.1660972 0.0256779 -0.0704461 -0.0005426 -0.0574906 0.0268182 -0.0011156 -0.0004344 -0.0011194 0.1646752 0.0401821 0.0435198 0.0899261 0.019865 0.051895 0.0099297 0.0835849 -0.0427357 -0.008159 -0.0595971 -0.1867761 -0.0015922 -0.1098824 -0.0414477 -0.0012493 -0.000925 -0.0012544 0.108042 0.0402565 0.0449692 -0.0891652 0.0213201 0.051223 -0.0088919 -0.0832767 0.0437474 -0.0077085 0.1680523 -0.0837796 -0.0006661 -0.2068793 0.2890745 -0.0008085 -0.0016716 -0.0008185 0.3910176 unknown
polarizability: 246.9694155|-5.1505165|155.2624581|-0.0788115|0.7735525|59.9838316 unknown
InChI: InChI=1S/C11H8ClNO3/c1-5-8(12)3-2-6-9(5)13-4-7(10(6)14)11(15)16/h2-4,13,15H,1H3
charge 0 multiplicity 1
24 atoms
Cl -4.892964 -0.040206 -0.03998
O  1.579439 -2.212229 -0.05903
O  4.103379 -1.03369 -0.049953
O  4.198085 1.280143 -0.03118
N  0.080195 1.664641 -0.027481
C  -0.844055 0.601222 -0.035926
C  -0.31436 -0.723922 -0.046822
C  -2.251317 0.86025 -0.033496
C  1.164355 -1.011153 -0.049402
C  -1.214533 -1.817659 -0.05557
C  2.0198 0.197922 -0.039705
C  -3.085012 -0.277992 -0.0425
C  1.432776 1.460862 -0.029397
C  -2.600288 -1.606289 -0.053499
C  -2.848013 2.256223 -0.022043
C  3.505806 0.220992 -0.039675
H  -0.271072 2.622162 -0.019652
H  -0.786781 -2.824961 -0.063944
H  2.074058 2.347699 -0.02229
H  -3.30292 -2.443915 -0.06019
H  -3.490534 2.397758 0.865551
H  -2.100177 3.067969 -0.015105
H  -3.49014 2.412526 -0.907454
H  5.092272 -0.902452 -0.048955
