program: Gaussian 09
title: 000291983
version: EM64L-G09RevD.01
frameworkgroup: C1[X(C10H7Cl3N2O)]
method: RPBEPBE
basis: SDD
operation: Freq
keyword: #p
keyword: freq=noraman
keyword: PBEPBE/SDD
title: #p freq=noraman PBEPBE/SDD
converged: YES YES NO NO
title: Mulliken charges:
elementType: Cl Cl Cl O N N C C C C C C C C C C H H H H H H H
charge: 0.164739 0.108356 0.108632 -0.218218 -0.126860 -0.068120 0.300106 0.448208 -0.472204 0.113273 -0.365300 -0.408854 -0.204513 0.530056 -0.801804 -0.829108 0.276433 0.265336 0.240321 0.236127 0.239041 0.225397 0.238956
chargesum: 0.00000
title: Mulliken charges with hydrogens summed into heavy atoms:
elementType: Cl Cl Cl O N N C C C C C C C C C C
charge: 0.164739 0.108356 0.108632 -0.218218 -0.126860 -0.068120 0.300106 0.448208 -0.195771 0.113273 -0.099964 -0.168534 0.031614 0.530056 -0.098409 -0.829108
polarizability: 2.51310791e+02 9.13342009e+00 1.54978838e+02 3.12150151e-01 -6.44085903e-02 9.27273868e+01
1716.lowfreq: -44.7156 -11.5207 -5.1924 -1.5385 -0.0026 -0.0016 -0.0010 19.6771 33.3564
frequency: -44.6901 19.6060 33.3176 62.7394 82.0101 114.7755 139.1529 180.3361 206.2631 221.0247 234.8921 269.1069 292.1446 347.3891 369.1970 370.7376 402.4936 437.2692 482.5662 521.8532 533.9073 627.7960 671.9718 688.6427 703.6916 729.0557 735.7461 805.8224 807.0232 834.3898 881.7960 910.4038 915.5161 944.2882 962.0540 986.6513 994.1765 995.8009 1053.4763 1055.3871 1101.0382 1152.8314 1187.3226 1223.3907 1267.8691 1311.7293 1385.0390 1402.1449 1421.2459 1445.0650 1453.3385 1470.3995 1478.2698 1523.2235 1595.6456 1617.4262 2984.4459 3064.8202 3092.0147 3131.3510 3146.1610 3152.1870 3172.5551
redmass: 1.0247 6.7410 7.3688 7.9292 11.9317 8.0195 8.1872 11.6273 3.8255 6.4740 19.8362 10.7375 6.7259 5.7629 7.4901 9.4136 14.8107 2.9972 6.4268 5.3914 4.4218 13.2378 6.9937 5.6134 2.3580 8.7420 12.6330 10.7518 1.5348 5.9418 14.0632 1.3178 13.7230 1.4103 5.4957 3.8658 2.1630 1.3602 1.5783 3.0747 1.7093 3.0631 1.1131 3.2544 5.0122 1.3376 5.9216 1.2732 2.6335 8.2990 3.5669 1.0447 1.1631 5.0803 5.8755 6.0934 1.0374 1.0977 1.0991 1.0882 1.0927 1.0920 1.0986
irintensity: 0.6300 0.5158 0.9414 0.2318 2.4686 0.3327 2.4478 0.1742 1.7246 0.1247 0.1943 0.2606 0.9063 0.0838 1.5713 2.8002 3.7725 2.5809 7.7681 3.5587 3.3651 106.1827 1.8858 9.2861 81.8988 21.0090 138.3121 112.7297 40.2965 41.6761 2.0301 1.2613 76.2941 6.5119 7.4706 0.1730 1.1862 0.0226 14.0919 1.4680 17.6956 11.1857 0.8263 16.5098 7.8184 9.2826 3.4437 13.9987 31.0451 0.4991 163.9658 14.4884 31.6756 81.6681 33.6370 11.0918 26.7336 15.6400 17.6390 7.2479 1.5693 15.2602 9.1478
temp: 298.150 k
press: 1.00000 atm
elementType: 17 17 17 8 7 7 6 6 6 6 6 6 6 6 6 6 1 1 1 1 1 1 1
symmnumber: 1
zpe: 391202.7 jmol-1
zpe.correction: 0.149001 hartree
zpe.thermalcorrener: 0.163394 hartree
zpe.thermalcorrenthalpy: 0.164338 hartree
zpe.thermalcorrgfe: 0.104786 hartree
zpe.sumelectzpe: -1948.975986 hartree
zpe.sumelectthermal: -1948.961594 hartree
zpe.sumelectthermalent: -1948.960649 hartree
zpe.sumelectthermalfe: -1949.020202 hartree
dipole: 4.4746 2.2781 0.0304
dipole: 5.0212
quadrupole: -93.8843 -114.9659 -114.4659
quadrupole: 0.3648 0.1201 -0.2440
quadrupole: 13.8878 -7.1939 -6.6939 0.3648 0.1201 -0.2440
hfenergy: -1949.1249875 hartree
pointgroup: C01 [X(C10H7Cl3N2O1)]
dipole: 1.7813852 -0.8518809 -0.059958 debye
dipolederiv: -0.4098807 0.3299559 0.0287645 0.2651929 -0.4037472 -0.0273755 0.0211955 -0.0275202 -0.1036867 -0.3157091 -0.0492609 -0.0560022 -0.2329419 -0.2977872 -0.2895234 -0.1874778 -0.2629183 -0.6316946 -0.3058036 -0.0528137 0.0436484 -0.2505383 -0.3932901 0.3292181 0.139261 0.3000344 -0.5346673 -0.743166 0.054803 0.0057166 -0.1883723 -0.5007155 -0.0291564 -0.0125311 -0.030751 -0.0335897 -0.7427722 -0.0503136 -0.0033588 0.7557609 -0.2477869 -0.0053402 0.0510735 -0.0060635 -0.1717469 0.1418129 0.0749847 0.0052878 -0.0085495 -0.0205692 0.0102498 -0.0055412 0.012935 -0.1985889 -0.4474743 0.0997377 0.0067977 0.1467371 0.0165435 -0.0015953 0.0087902 -0.0003252 0.0178659 0.2423426 0.3263662 0.0116744 0.4328936 0.0820476 0.0003784 0.0142394 0.0007031 -0.0149774 -0.0381483 -0.229454 -0.0106278 0.1395261 -0.0027608 0.0050199 0.0090653 0.0083278 -0.1399401 1.3490599 -0.1864165 -0.0148175 -0.5803752 0.3773086 0.0167189 -0.0380464 0.0149039 0.1421454 0.0314616 0.0508125 0.0006829 -0.2176487 -0.04449 0.0050187 -0.0134942 0.0044096 -0.1378017 0.026103 -0.0549368 -0.0037772 -0.1167222 -0.048914 0.0059814 -0.0062108 0.004831 -0.150701 -0.225365 -0.0655458 -0.0026012 -0.1157593 0.1688332 0.013552 -0.00351 0.0130211 -0.1285992 -0.2210811 -0.0814023 -0.0058862 -0.1834499 0.1017984 0.0090665 0.0007524 0.0114975 -0.0345033 -0.016897 -0.094381 -0.0034052 -0.1715361 -0.0834252 -0.0041139 -0.0065608 -0.0044113 0.0508149 1.5723858 -0.1182525 -0.009043 0.2326193 1.2122385 -0.0131529 0.0195391 -0.0135381 1.4112449 0.1350168 0.026332 0.0013536 0.0148904 -0.010056 -0.0065725 0.0003971 -0.0070413 0.1480088 0.0290629 -0.0758774 -0.0018188 -0.0724793 0.0568484 -0.0035126 -0.0013888 -0.0036032 0.1549816 -0.1083846 0.0631861 0.0048524 0.0479193 0.0811378 -0.0033416 0.0044459 -0.0034996 0.1510244 0.0620781 0.0277682 0.0019412 0.0528135 -0.1014832 -0.0113583 0.0033379 -0.0112349 0.155356 0.047976 -0.0175578 0.0341863 -0.0500308 0.0266855 -0.0994243 -0.0321311 -0.1168829 -0.0403924 -0.1103918 0.0347304 0.0033842 0.1506395 0.0236727 -0.0050336 0.0084487 -0.0040992 0.1112101 0.0477742 -0.0124647 -0.0369522 -0.0505891 0.0079112 0.1042969 0.0263459 0.1212253 -0.021763 unknown
polarizability: 251.689396|-6.7627106|154.4519265|-1.1907375|2.984614|92.8756933 unknown
InChI: InChI=1S/C10H7Cl3N2O/c1-6-3-2-4-7(5-6)8-14-15-9(16-8)10(11,12)13/h2-5H,1H3
charge 0 multiplicity 1
23 atoms
Cl -4.840582 1.113466 0.11845
Cl -3.78593 -1.149599 -1.594723
Cl -3.769025 -1.398421 1.429043
O  -1.088205 -0.476559 -0.013465
N  -0.401231 1.695692 0.121174
N  -1.833855 1.677361 0.124994
C  1.369341 -0.105625 0.002308
C  3.791397 0.345863 0.00024
C  2.455832 0.808947 0.032642
C  0.01173 0.418546 0.038597
C  1.610426 -1.505068 -0.060944
C  4.017759 -1.054649 -0.061865
C  2.938841 -1.969549 -0.092079
C  -2.194739 0.395695 0.04446
C  4.948064 1.328874 0.031014
C  -3.556732 -0.197098 0.004588
H  2.241066 1.882445 0.081205
H  0.76989 -2.205251 -0.083842
H  5.047376 -1.430346 -0.086572
H  3.137635 -3.045249 -0.139724
H  4.923022 1.947477 0.947105
H  5.921214 0.810554 0.00007
H  4.906405 2.022096 -0.829372
