program: Gaussian 09
title: 000292020
version: EM64L-G09RevD.01
frameworkgroup: C1[X(C12H8Cl3N3O4S)]
method: RPBEPBE
basis: SDD
operation: Freq
keyword: #p
keyword: freq=noraman
keyword: PBEPBE/SDD
title: #p freq=noraman PBEPBE/SDD
converged: YES YES NO NO
title: Mulliken charges:
elementType: Cl Cl Cl S O O O O N N N C C C C C C C C C C C C H H H H H H H H
charge: -0.007298 0.036264 -0.002570 0.820632 -0.559244 -0.553850 -0.196025 -0.203938 -0.290464 -0.370434 0.024554 -0.083954 -0.296596 -0.240827 0.804346 0.385380 -0.172692 -0.354620 -0.302661 -0.270281 -0.236861 -0.181147 -0.122596 0.287205 0.316224 0.301452 0.337995 0.251355 0.291362 0.288961 0.300324
chargesum: 0.00000
title: Mulliken charges with hydrogens summed into heavy atoms:
elementType: Cl Cl Cl S O O O O N N N C C C C C C C C C C C C
charge: -0.007298 0.036264 -0.002570 0.820632 -0.559244 -0.553850 -0.196025 -0.203938 -0.003258 -0.032439 0.024554 -0.083954 0.019628 0.060625 0.804346 0.385380 0.078663 -0.063258 -0.302661 -0.270281 0.052101 0.119177 -0.122596
polarizability: 3.26414734e+02 3.44828705e+01 2.85712715e+02 -1.09830434e+01 4.29895904e+00 1.47316582e+02
1716.lowfreq: -4.1009 -1.4063 -0.0024 -0.0017 -0.0013 3.7936 18.5302 21.7453 27.4669
frequency: 18.4911 21.7230 27.4584 38.8361 43.4899 58.3514 68.4854 84.0875 121.1961 135.1545 146.3834 175.0629 178.9965 194.4510 200.8473 204.0513 211.3605 224.8142 236.8204 306.3833 316.8668 337.4141 349.5769 351.7426 369.1122 395.8105 410.3149 415.3570 424.5214 432.2660 501.0325 510.2399 520.2066 548.0412 587.3642 635.0422 669.6447 676.7166 684.1821 693.5791 701.8241 735.6849 751.3108 759.8510 801.0677 820.1994 823.0991 855.8870 859.0363 869.3829 872.8617 930.5576 960.0556 981.1814 1007.1906 1046.7647 1050.1772 1077.5691 1097.6723 1114.0214 1163.6745 1167.1654 1213.6270 1215.0654 1239.5329 1266.1202 1329.8864 1369.1123 1375.7016 1396.7328 1403.1521 1421.2528 1444.3919 1445.7287 1539.8691 1572.7500 1584.6643 1593.0204 1597.8365 3148.8572 3165.6873 3175.7861 3188.3352 3190.0752 3192.8570 3273.6331 3352.6428
redmass: 14.3443 8.3282 13.2221 15.7370 12.5911 13.5737 16.0416 12.9607 13.1951 10.9352 6.6820 18.9318 5.7640 4.9572 8.7612 15.8412 9.5241 6.2368 6.9726 9.0081 7.6358 10.8510 19.1140 8.9708 7.0845 9.0749 7.3790 6.7702 3.8785 5.9768 5.3079 6.6653 6.7200 3.9179 6.7686 7.1055 3.7030 2.5808 5.7995 5.2696 3.9696 2.6668 8.6173 8.4561 9.7157 1.4134 3.0177 1.7154 1.4332 1.3623 6.2066 1.4394 1.3732 5.9761 1.3590 3.5911 2.0153 1.7347 2.8305 2.9515 1.7366 1.4558 9.1199 1.9686 2.1479 1.3223 2.5943 8.7054 3.0251 2.9104 9.2616 3.0393 2.3738 2.8181 3.5676 3.8176 6.9676 2.4118 7.6288 1.0889 1.0937 1.0920 1.0968 1.0936 1.0938 1.0759 1.0771
irintensity: 0.6023 1.5642 0.7121 2.2964 2.6448 2.0432 1.6984 4.6682 17.0303 2.5656 7.5454 0.1104 6.3039 0.6962 8.3510 8.8039 5.8904 8.0958 15.4804 23.1847 8.7295 1.9508 5.6728 16.3520 18.2514 2.8502 20.0269 7.9134 6.8343 18.6680 1.8031 17.7973 19.9197 15.7709 14.1644 4.2610 10.1529 22.4635 11.9660 1.5598 24.2364 92.9877 29.2632 136.0317 14.8452 45.9877 64.7147 16.0099 52.4280 0.9580 48.0120 6.2088 2.3980 3.3885 2.0914 6.1291 9.1312 39.3815 10.8085 35.9326 71.7964 18.1924 185.1292 10.3975 71.8551 0.8824 25.2996 94.1930 39.6917 21.1294 0.8987 63.1207 28.5938 54.4908 131.1444 131.8403 9.8011 11.3315 3.5164 3.3303 12.4726 12.5306 3.0280 3.1695 2.5719 11.6559 120.0601
temp: 298.150 k
press: 1.00000 atm
elementType: 17 17 17 16 8 8 8 8 7 7 7 6 6 6 6 6 6 6 6 6 6 6 6 1 1 1 1 1 1 1 1
symmnumber: 1
zpe: 494464.6 jmol-1
zpe.correction: 0.188332 hartree
zpe.thermalcorrener: 0.211094 hartree
zpe.thermalcorrenthalpy: 0.212039 hartree
zpe.thermalcorrgfe: 0.132589 hartree
zpe.sumelectzpe: -2703.530611 hartree
zpe.sumelectthermal: -2703.507849 hartree
zpe.sumelectthermalent: -2703.506904 hartree
zpe.sumelectthermalfe: -2703.586354 hartree
dipole: 0.8452 -1.5111 3.0676
dipole: 3.5225
quadrupole: -137.3766 -177.9963 -164.3483
quadrupole: -9.5508 -2.4781 -9.3043
quadrupole: 22.5305 -18.0892 -4.4412 -9.5508 -2.4781 -9.3043
hfenergy: -2703.7189429 hartree
pointgroup: C01 [X(C12H8Cl3N3O4S1)]
dipole: 0.0336389 -1.2770812 -0.5371498 debye
polarizability: 337.2618296|-3.0870141|211.2379642|-32.6027979|-61.349116|210.9442377 unknown
InChI: InChI=1S/C6H4Cl3N2.C6H4NO4S/c7-3-1-4(8)6(11-10)5(9)2-3;8-7(9)5-2-1-3-6(4-5)12(10)11/h1-2,10-11H;1-4H
charge 0 multiplicity 1
31 atoms
Cl -0.773745 -2.753424 3.498647
Cl -1.132139 -1.725731 -2.045507
Cl -4.969299 0.169291 1.392126
S  2.422586 -0.780452 0.471219
O  1.446854 -0.580239 1.800522
O  4.065485 -0.805237 0.639064
O  -1.025432 3.844307 -2.490242
O  -1.799591 2.154418 -1.169331
N  1.136067 -2.644239 -0.327636
N  0.272865 -2.784474 0.70092
N  -0.847076 2.797235 -1.759439
C  2.072311 0.71829 -0.64471
C  0.758256 1.189222 -0.740638
C  3.15359 1.294536 -1.333457
C  -0.962899 -2.104455 0.772449
C  0.54076 2.289499 -1.595918
C  2.899761 2.410798 -2.166433
C  1.589378 2.91297 -2.3087
C  -1.584355 -1.993585 2.054948
C  -1.675412 -1.543271 -0.328323
C  -2.793377 -1.322596 2.26666
C  -2.882048 -0.839962 -0.141887
C  -3.422921 -0.734255 1.150719
H  1.922516 -3.318113 -0.174683
H  -0.066999 0.751749 -0.172733
H  4.160899 0.886351 -1.195977
H  0.560372 -3.204274 1.601273
H  3.725451 2.884556 -2.706093
H  1.365671 3.7669 -2.953357
H  -3.224261 -1.248856 3.267365
H  -3.383166 -0.385557 -0.999143
