program: Gaussian 09
title: 000292012
version: EM64L-G09RevD.01
frameworkgroup: C1[X(C19H23N5O)]
method: RPBEPBE
basis: SDD
operation: Freq
keyword: #p
keyword: freq=noraman
keyword: PBEPBE/SDD
title: #p freq=noraman PBEPBE/SDD
converged: YES YES NO NO
title: Mulliken charges:
elementType: O N N N N N C C C C C C C C C C C C C C C C C C C H H H H H H H H H H H H H H H H H H H H H H H
charge: -0.208815 -0.461917 -0.342762 -0.089028 -0.073896 -0.172869 0.239929 -0.542132 0.335511 0.003063 -0.523205 0.084910 0.139393 0.389767 0.360780 0.067028 -0.587530 -0.565989 -0.022947 -0.791304 -0.787811 0.239574 -0.826148 -0.827288 -0.766800 0.247312 0.235432 0.250429 0.240768 0.235713 0.368457 0.249897 0.359797 0.244089 0.225340 0.262337 0.231152 0.249911 0.244826 0.223689 0.226723 0.223360 0.233625 0.220402 0.220800 0.260403 0.241721 0.234302
chargesum: 0.00000
title: Mulliken charges with hydrogens summed into heavy atoms:
elementType: O N N N N N C C C C C C C C C C C C C C C C C C C
charge: -0.208815 -0.093459 0.017035 -0.089028 -0.073896 -0.172869 0.239929 -0.059389 0.335511 0.003063 -0.032008 0.084910 0.139393 0.389767 0.360780 0.067028 -0.351817 -0.316093 -0.022947 -0.059537 -0.061921 0.239574 -0.152376 -0.152462 -0.030375
polarizability: 4.69187930e+02 -1.95181765e+01 2.38976032e+02 1.52370882e+01 1.15259042e+01 1.43887753e+02
1716.lowfreq: -10.4318 -1.5095 -0.0014 -0.0004 0.0007 1.7656 16.5765 19.3297 28.9126
frequency: 16.3916 18.9913 28.8923 42.0693 53.2462 59.5073 84.7270 103.0249 107.9513 112.6400 114.3561 117.9600 124.3939 148.9759 162.5424 166.2173 186.4014 206.4445 232.3234 236.5995 274.8971 298.4167 304.2869 312.6587 327.0049 332.7110 362.4163 393.3852 433.1659 438.3682 439.7952 460.3797 474.6887 501.7749 529.6671 543.8262 551.5710 569.2382 571.4495 637.6161 651.6005 672.2105 683.3502 701.6182 720.4534 726.5320 755.9549 764.9655 768.1228 779.5925 788.7948 829.4125 846.1461 855.1328 861.1062 885.4934 890.7315 918.8255 946.8202 956.4836 990.5385 1000.8373 1002.8076 1009.0110 1028.8549 1031.4195 1040.3755 1050.9877 1051.1569 1058.0353 1080.1673 1095.3125 1161.6781 1166.4227 1169.6067 1183.7443 1197.3397 1236.2690 1246.9101 1257.0946 1272.2508 1284.7634 1302.7864 1309.8238 1343.0243 1370.3854 1374.4387 1386.2673 1389.7070 1391.5148 1393.5011 1401.9901 1404.3134 1426.8538 1432.2762 1436.8600 1442.9531 1450.0617 1455.8627 1460.1111 1461.9912 1462.6041 1467.4944 1469.2180 1474.9709 1477.1875 1481.1586 1489.4256 1490.0882 1518.0153 1555.1630 1577.3721 1601.3053 1634.7033 1652.8132 2964.3357 2965.4218 2966.4822 2981.5402 2985.3894 2987.3640 3010.6681 3020.2841 3034.0630 3037.1766 3061.6098 3065.9114 3067.3689 3074.9132 3077.5891 3081.5522 3116.1948 3121.1844 3122.2265 3132.4357 3148.7815 3395.2733 3558.1888
redmass: 5.1367 5.9921 3.6375 4.0530 3.9901 4.1671 1.0759 1.7571 1.9675 1.1255 1.1100 1.5592 3.0478 3.0917 5.1319 1.2086 4.6412 3.6271 4.4766 4.7366 4.2742 2.5438 3.2012 2.2883 4.3467 3.7142 3.6895 5.3490 3.6906 3.2979 3.5584 2.2716 4.4576 4.1831 4.2812 4.6204 4.6315 3.5467 4.3049 2.3544 3.8628 2.7781 5.5166 2.4524 2.3367 2.2720 3.6407 4.9312 3.4648 4.7615 5.2377 1.1805 3.1309 3.1890 1.4129 1.4531 1.7844 2.8494 2.1498 2.3008 2.2270 1.5066 1.7178 1.7815 1.4326 1.8350 1.5659 1.6261 2.6524 2.5056 2.3103 3.3892 1.5010 1.6672 1.9204 3.1464 3.2733 2.0147 3.8875 1.5074 1.3081 1.5781 3.3818 7.8687 1.6459 1.2378 3.6453 2.4671 1.7160 1.3068 1.6174 2.4116 1.3208 1.2551 1.7466 2.0109 1.0701 1.7494 1.0581 1.0481 1.4782 1.6463 1.0533 1.0521 1.0571 1.4064 1.1077 1.6892 2.2451 6.4907 5.7431 5.8725 6.6482 7.7457 7.2019 1.0378 1.0378 1.0602 1.0389 1.0391 1.0389 1.0966 1.0613 1.0971 1.0969 1.0964 1.0963 1.0949 1.1011 1.0981 1.0973 1.0984 1.1005 1.0980 1.0921 1.0923 1.0840 1.0764
irintensity: 0.5386 4.4558 1.6991 1.6354 0.6335 1.8569 0.0955 0.7785 0.4940 0.0196 0.6622 1.1875 1.6110 0.7981 3.5756 0.7027 6.8897 4.3808 2.6000 0.8691 0.4790 0.3524 0.2424 0.0737 1.5205 6.3488 5.2286 8.0995 4.7060 4.5121 5.9597 2.9812 1.0729 2.1964 5.3490 6.5731 5.5223 12.3060 3.8542 20.9240 0.5120 23.5421 1.7898 61.5216 2.7522 2.0591 6.2901 5.5468 2.3966 2.7858 1.0628 66.3590 4.2661 1.5182 49.7129 12.3890 4.4940 16.1595 4.7445 11.1458 4.6348 19.5536 16.6755 1.1392 16.4766 8.1086 0.4647 0.0756 5.4636 9.0518 0.2992 26.1551 15.4058 6.7301 62.2497 15.6072 11.6647 10.4261 2.8146 5.0297 32.2017 51.4185 1.1763 59.2011 99.4711 58.3896 89.5794 108.5891 21.9217 26.5580 77.0592 26.9456 8.0499 9.8776 19.6515 59.4775 18.3965 120.9216 23.2996 0.0806 25.2456 54.8381 15.4230 25.9171 30.2197 38.4949 8.8223 21.4000 33.9946 174.3402 455.4765 484.4355 652.3664 111.8313 134.4755 89.7779 43.4655 12.9905 5.2813 15.8552 11.8989 7.5065 16.4173 48.9583 2.5181 15.0227 13.9105 11.6882 17.3578 37.5035 9.1741 16.0329 15.8568 8.7187 13.8121 11.4185 372.4061 89.6420
temp: 298.150 k
press: 1.00000 atm
elementType: 8 7 7 7 7 7 6 6 6 6 6 6 6 6 6 6 6 6 6 6 6 6 6 6 6 1 1 1 1 1 1 1 1 1 1 1 1 1 1 1 1 1 1 1 1 1 1 1
symmnumber: 1
zpe: 1020786.0 jmol-1
zpe.correction: 0.388797 hartree
zpe.thermalcorrener: 0.414017 hartree
zpe.thermalcorrenthalpy: 0.414962 hartree
zpe.thermalcorrgfe: 0.331113 hartree
zpe.sumelectzpe: -1085.038650 hartree
zpe.sumelectthermal: -1085.013429 hartree
zpe.sumelectthermalent: -1085.012485 hartree
zpe.sumelectthermalfe: -1085.096333 hartree
dipole: -3.6552 -3.5333 1.5612
dipole: 5.3181
quadrupole: -149.6944 -143.0183 -149.7770
quadrupole: -7.6955 -17.6689 -2.3205
quadrupole: -2.1978 4.4783 -2.2805 -7.6955 -17.6689 -2.3205
hfenergy: -1085.4274466 hartree
pointgroup: C01 [X(C19H23N5O1)]
dipole: -1.3230479 -0.5358792 1.529737 debye
polarizability: 471.2842577|-5.8332743|201.8795972|2.2971659|-47.4278076|178.8878604 unknown
InChI: InChI=1S/C19H23N5O/c1-10-8-16-17(9-11(10)2)23-19(22-16)24-18-20-13(4)15(14(5)21-18)7-6-12(3)25/h8-9,22,24H,6-7H2,1-5H3
charge 0 multiplicity 1
48 atoms
O  -7.260797 -1.294129 0.778227
N  1.918578 -0.203402 -0.314349
N  0.433419 1.368667 -1.451012
N  2.835798 1.557216 -1.474754
N  -1.884134 1.455261 -1.612143
N  -0.807662 -0.319748 -0.32469
C  -3.245345 -0.221719 -0.466788
C  -4.610465 -0.765244 -0.087041
C  3.309377 -0.332219 -0.16782
C  3.865086 0.774311 -0.897631
C  -5.159133 -0.129533 1.216159
C  -3.105443 0.940488 -1.293706
C  -2.041109 -0.827444 -0.0070
C  5.526504 -1.094582 0.443716
C  6.099379 0.010292 -0.282595
C  1.707308 0.928913 -1.094697
C  4.122761 -1.265665 0.500557
C  5.266302 0.937455 -0.948876
C  -0.786418 0.805779 -1.109869
C  -4.297783 1.662295 -1.882471
C  -2.038457 -2.078725 0.844953
C  -6.574514 -0.598948 1.573363
C  6.430249 -2.086854 1.156662
C  7.608808 0.182536 -0.335736
C  -7.103014 -0.190148 2.943549
H  -5.342906 -0.588492 -0.893524
H  -4.574293 -1.861333 0.043086
H  -5.183861 0.977051 1.126238
H  -4.488281 -0.329566 2.076457
H  3.695519 -2.109222 1.054085
H  1.11922 -0.754367 0.03024
H  5.696895 1.777953 -1.502692
H  0.396167 2.205348 -2.037189
H  -4.832605 1.021086 -2.608494
H  -5.031328 1.953444 -1.10852
H  -3.950582 2.566331 -2.404391
H  -2.687909 -1.973428 1.732232
H  -2.408683 -2.95019 0.272584
H  -1.013276 -2.29662 1.181165
H  7.04792 -1.594204 1.932886
H  5.842752 -2.880212 1.650032
H  7.134521 -2.576094 0.45601
H  7.885016 1.072293 -0.926565
H  8.044781 0.301479 0.675407
H  8.106853 -0.693825 -0.794766
H  -8.198318 -0.298001 2.978336
H  -6.66445 -0.850603 3.717554
H  -6.814952 0.845222 3.200021
