program: Gaussian 09
title: 000291975
version: EM64L-G09RevD.01
frameworkgroup: C1[X(C9H16O3)]
method: RPBEPBE
basis: SDD
operation: Freq
keyword: #pfreq=noraman
keyword: PBEPBE/SDD
title: #p freq=noraman PBEPBE/SDD
converged: YES YES NO NO
title: Mulliken charges:
elementType: O O O C C C C C C C C C H H H H H H H H H H H H H H H H
charge: -0.266679 -0.210673 -0.246053 -0.146439 -0.378223 -0.525123 -0.724123 0.218156 0.239548 -0.785249 -0.262863 -0.663124 0.217956 0.213783 0.233420 0.289656 0.230502 0.230957 0.228552 0.227606 0.230325 0.255534 0.247741 0.231619 0.220723 0.214405 0.227988 0.250075
chargesum: 0.00000
title: Mulliken charges with hydrogens summed into heavy atoms:
elementType: O O O C C C C C C C C C
charge: -0.266679 -0.210673 -0.246053 0.071518 0.068980 -0.004965 -0.037007 0.218156 0.239548 -0.051649 0.189479 0.029344
polarizability: 1.32465752e+02 4.46393178e+00 9.89151826e+01 -3.99749545e+00 2.06846636e+00 8.61141785e+01
1716.lowfreq: -10.2913 -7.0140 -0.0003 0.0010 0.0011 6.6243 13.7239 34.4599 45.2083
frequency: 12.7984 34.4426 45.1670 64.8086 89.4181 94.1534 110.0687 114.9679 180.4091 213.8902 227.7298 263.9729 273.9995 291.5701 319.5763 402.4096 429.3378 486.9708 547.4610 553.0606 605.9387 651.1471 704.0312 784.1698 787.6769 816.8956 892.5141 916.1212 951.9288 963.7087 979.9558 1009.8694 1038.3270 1080.8153 1095.0217 1101.1832 1113.3632 1134.7071 1155.4074 1157.5567 1198.1722 1247.1418 1277.8563 1279.0470 1293.7369 1339.5490 1352.8298 1366.5465 1371.2746 1390.1848 1390.8349 1442.7496 1446.1437 1456.0745 1457.1204 1457.6266 1463.4090 1480.1903 1483.4694 1485.0896 1620.9211 1641.5755 2950.4243 2983.9144 2985.2912 2990.4282 2992.2130 3008.5746 3026.4117 3048.6292 3074.0018 3074.3216 3084.2947 3086.2229 3087.3301 3090.9141 3113.5802 3117.0210
redmass: 4.3977 3.4113 3.1943 3.4775 1.1959 3.7863 2.5160 2.3326 2.8511 1.3108 1.2558 3.0546 2.5559 2.4034 3.1113 3.1442 3.2778 3.0327 3.5533 2.7193 2.5051 3.8685 2.4957 1.5868 1.8961 1.7787 3.5356 1.6827 1.4758 1.5238 1.9366 2.8026 2.9855 1.9998 2.2242 3.1160 2.0720 3.0906 1.6162 1.4543 1.8317 1.2932 1.1472 1.1698 1.5261 1.5532 1.3225 1.6143 1.2291 1.2261 1.2242 1.0862 1.0650 1.0782 1.0831 1.0813 1.0430 1.0477 1.0579 1.0513 8.6697 8.7252 1.0816 1.0360 1.0367 1.0632 1.0362 1.0609 1.0594 1.0947 1.1011 1.0953 1.1005 1.0997 1.0974 1.1035 1.1013 1.1056
irintensity: 1.6141 0.9453 3.5927 0.7733 0.2874 3.6766 0.4612 4.8936 0.6277 1.9942 1.9725 7.0562 4.8931 1.2994 11.9291 3.8036 11.5082 3.7580 3.3868 2.1481 0.4914 4.8389 13.3942 5.8150 7.3121 2.6444 15.0261 3.4773 19.3647 6.2469 0.8710 29.9017 59.4572 5.8649 58.2436 44.2435 42.0703 250.6461 14.4449 12.3302 28.2127 23.7715 2.4525 10.3294 70.3066 12.3253 0.6289 29.0060 43.4330 24.4810 17.8468 18.7763 23.2536 30.0791 20.8676 0.7762 13.8677 8.2860 14.6658 13.7632 106.6098 153.2787 17.2439 12.4792 19.5940 11.0344 20.0622 21.5221 34.1036 4.1192 5.3192 18.7784 35.4343 36.2920 37.3953 0.6023 13.4852 34.9054
temp: 298.150 k
press: 1.00000 atm
elementType: 8 8 8 6 6 6 6 6 6 6 6 6 1 1 1 1 1 1 1 1 1 1 1 1 1 1 1 1
symmnumber: 1
zpe: 618180.2 jmol-1
zpe.correction: 0.235452 hartree
zpe.thermalcorrener: 0.250518 hartree
zpe.thermalcorrenthalpy: 0.251462 hartree
zpe.thermalcorrgfe: 0.190531 hartree
zpe.sumelectzpe: -577.265330 hartree
zpe.sumelectthermal: -577.250264 hartree
zpe.sumelectthermalent: -577.249320 hartree
zpe.sumelectthermalfe: -577.310251 hartree
dipole: 1.5548 0.4013 -2.4732
dipole: 2.9488
quadrupole: -53.4332 -78.9893 -74.8536
quadrupole: 5.8715 -2.0104 0.1027
quadrupole: 15.6588 -9.8973 -5.7616 5.8715 -2.0104 0.1027
hfenergy: -577.5007821 hartree
pointgroup: C01 [X(C9H16O3)]
dipole: -0.5959451 -0.2371789 -0.9667098 debye
polarizability: 132.6008989|3.4921196|97.9554663|4.6038279|-3.4650415|86.9387476 unknown
InChI: InChI=1S/C9H16O3/c1-4-12-9(11)6-5-7(2)8(3)10/h7H,4-6H2,1-3H3
charge 0 multiplicity 1
28 atoms
O  2.713326 0.302489 -0.927595
O  -1.92239 1.805999 0.536179
O  2.01472 -1.305584 0.614343
C  -2.180919 -0.423281 -0.458252
C  -0.767481 -0.746466 0.073951
C  0.349962 0.020984 -0.658281
C  -3.24252 -1.381832 0.159449
C  -2.602885 1.034244 -0.193227
C  1.738638 -0.421663 -0.230011
C  -3.91109 1.512353 -0.820909
C  4.1391 0.005101 -0.587233
C  4.594859 0.842431 0.611376
H  -2.205876 -0.569888 -1.560832
H  -0.587861 -1.834061 -0.017321
H  -0.721912 -0.506471 1.1518
H  0.260918 1.106011 -0.467891
H  0.276629 -0.108701 -1.756616
H  -3.263048 -1.279954 1.259816
H  -2.984783 -2.42875 -0.080015
H  -4.258448 -1.185452 -0.226453
H  -4.163875 0.960379 -1.742465
H  -3.848439 2.592656 -1.03101
H  -4.739071 1.363813 -0.100639
H  4.234184 -1.075629 -0.380434
H  4.685962 0.267332 -1.507249
H  5.67239 0.675475 0.796887
H  4.439229 1.918395 0.42118
H  4.040681 0.556668 1.521049
