program: Gaussian 09
title: 000292008
version: EM64L-G09RevD.01
frameworkgroup: C1[X(C17H16N2O4S)]
method: RPBEPBE
basis: SDD
operation: Freq
keyword: #p
keyword: freq=noraman
keyword: PBEPBE/SDD
title: #p freq=noraman PBEPBE/SDD
converged: YES YES NO NO
title: Mulliken charges:
elementType: S O O O O N N C C C C C C C C C C C C C C C C C H H H H H H H H H H H H H H H H
charge: 0.995491 -0.568061 -0.216556 -0.497188 -0.499508 0.059661 -0.409940 -0.445459 -0.551518 -0.546512 0.311184 0.297265 -0.565464 -0.427989 0.481178 -0.401741 -0.397137 0.282957 -0.043116 -0.333865 -0.344488 -0.229368 -0.241021 0.174882 0.220546 0.226484 0.234305 0.229747 0.228928 0.230531 0.292176 0.242765 0.222079 0.205494 0.288956 0.244315 0.288341 0.287334 0.289225 0.385089
chargesum: 0.00000
title: Mulliken charges with hydrogens summed into heavy atoms:
elementType: S O O O O N N C C C C C C C C C C C C C C C C C
charge: 0.995491 -0.182972 -0.216556 -0.497188 -0.499508 0.059661 -0.120715 0.001572 -0.087467 -0.087053 0.311184 0.297265 -0.273288 -0.185224 0.481178 -0.179662 -0.191643 0.282957 -0.043116 -0.044909 -0.100173 0.058973 0.046313 0.174882
polarizability: 5.09165600e+02 -1.72377385e+01 2.28491526e+02 -7.72175059e-01 6.47518986e+00 1.29933451e+02
1716.lowfreq: -2.5515 -0.0021 -0.0008 0.0001 3.4405 6.0235 14.9201 19.7646 27.5822
frequency: 14.8681 19.5738 27.5709 40.6105 54.6845 67.2620 79.2414 109.3130 124.0367 147.2587 157.3124 172.4994 183.0532 196.4867 209.5655 228.4560 248.6006 261.1057 279.0442 298.8922 336.7831 352.1702 361.4867 368.2657 380.0596 407.7488 430.2875 436.1542 466.1899 486.1466 506.3019 549.5124 560.3593 566.7462 605.8056 615.1822 620.6002 629.4711 672.7042 698.8160 715.2954 744.4143 750.7687 787.0866 826.2038 834.5876 846.0643 850.6099 867.4642 870.0407 882.3172 913.2787 930.9032 940.3639 953.8468 964.1351 968.5944 973.1695 992.1365 998.8395 1019.0937 1024.5257 1047.2885 1049.4123 1059.7763 1094.1124 1112.3704 1120.1181 1128.5128 1156.4899 1166.4024 1185.4832 1200.9338 1214.9780 1237.3022 1251.1524 1262.2375 1284.9199 1292.5955 1295.3767 1315.8786 1341.1169 1383.8771 1389.0584 1391.3913 1440.7358 1456.7314 1458.4107 1465.5712 1478.3029 1484.9133 1511.3568 1564.2620 1582.8491 1587.8411 1595.2307 1619.5926 1624.1873 2956.4363 2970.7026 2977.2781 3007.1300 3046.1653 3053.8755 3080.8286 3114.1231 3137.5790 3141.3341 3150.3207 3159.9851 3167.0833 3177.1214 3377.9129 3481.5374
redmass: 6.1290 6.8364 7.1040 4.1103 5.1438 6.1735 6.7353 4.7923 9.2677 3.6786 3.5163 1.9686 3.4418 3.5429 3.1205 3.1859 6.8004 4.5146 3.7201 4.3518 7.7925 5.4606 5.7909 5.3584 6.0661 2.8829 3.0715 5.4325 5.9158 5.6702 4.8181 4.0710 8.4205 3.0183 3.6210 6.1861 2.4602 1.4823 5.3194 6.8172 2.7505 3.4732 3.4401 4.3884 1.3873 11.6277 1.3698 2.3142 3.2582 1.7129 1.6981 2.3356 1.3903 1.4718 2.9120 1.4745 15.7952 1.3992 3.8061 1.5423 2.8107 4.3034 1.3612 1.6868 1.8718 2.7425 1.7698 1.9889 1.3261 1.6403 1.2657 1.1283 1.5484 1.4295 3.0946 1.8835 1.2475 2.0793 1.3681 1.2542 1.4464 1.8100 5.1099 5.0785 3.4373 4.1837 1.1178 1.1717 2.1883 1.1063 2.3730 1.9508 6.9844 7.6017 6.0990 5.9975 8.3200 7.2479 1.0867 1.0660 1.0662 1.0644 1.0947 1.0944 1.1040 1.0876 1.0894 1.0962 1.0929 1.0890 1.0959 1.0974 1.0752 1.0661
irintensity: 0.0449 0.4862 0.1901 0.8077 1.0059 4.6095 6.9950 3.8634 1.7072 1.5903 4.0332 33.7813 13.8715 0.5241 25.2649 9.1748 8.8639 26.1489 44.3231 19.9078 5.3141 7.8821 21.6439 17.0080 19.3044 0.2911 4.8213 38.6701 13.8746 7.3733 15.1348 6.9686 180.1805 10.2949 6.7850 8.7066 1.7845 67.6548 29.8749 33.0023 8.3702 2.9630 8.5458 4.9870 24.0397 119.1264 7.0039 6.2165 27.6125 34.3243 7.9094 5.8864 2.2609 27.7007 11.0544 17.8443 92.1174 0.6942 7.2534 1.9511 1.1817 18.5866 36.3937 9.5953 99.4787 0.6557 106.8016 34.1887 5.7771 16.5854 16.5458 3.8662 2.6565 1.3669 199.6911 77.6773 2.7073 5.3839 4.8567 3.6627 8.9962 8.1480 7.3124 16.1822 25.2303 11.4067 17.5427 9.4448 25.5970 9.5646 69.9526 190.2584 54.8075 38.5761 61.7673 21.6922 164.9811 21.6194 62.7153 34.3810 25.2256 41.9939 35.6544 30.6571 53.0119 11.6108 10.7631 28.0156 0.6576 2.9739 4.9326 0.7074 27.6400 48.5367
temp: 298.150 k
press: 1.00000 atm
elementType: 16 8 8 8 8 7 7 6 6 6 6 6 6 6 6 6 6 6 6 6 6 6 6 6 1 1 1 1 1 1 1 1 1 1 1 1 1 1 1 1
symmnumber: 1
zpe: 780408.7 jmol-1
zpe.correction: 0.297242 hartree
zpe.thermalcorrener: 0.319807 hartree
zpe.thermalcorrenthalpy: 0.320751 hartree
zpe.thermalcorrgfe: 0.242360 hartree
zpe.sumelectzpe: -1463.956949 hartree
zpe.sumelectthermal: -1463.934384 hartree
zpe.sumelectthermalent: -1463.933440 hartree
zpe.sumelectthermalfe: -1464.011831 hartree
dipole: 5.4652 -4.2342 1.6746
dipole: 7.1134
quadrupole: -146.8249 -144.8106 -151.6789
quadrupole: 1.3448 -13.7619 -0.0503
quadrupole: 0.9466 2.9608 -3.9074 1.3448 -13.7619 -0.0503
hfenergy: -1464.2541908 hartree
pointgroup: C01 [X(C17H16N2O4S1)]
dipole: -2.1670394 1.6578336 0.6227968 debye
polarizability: 509.4163969|-14.8289396|227.9964843|2.8564296|-8.0686858|130.1776964 unknown
InChI: InChI=1S/C17H16N2O4S/c20-17(14-6-8-16(9-7-14)24(21,22)23)19-18-11-12-4-5-13-2-1-3-15(13)10-12/h4-11,19,21H,1-3H2
charge 0 multiplicity 1
40 atoms
S  7.038139 0.326143 -0.092764
O  7.081628 1.169634 1.563011
O  0.662177 -2.21507 0.074572
O  7.896808 -1.040997 0.002656
O  7.353116 1.422048 -1.240067
N  -1.235313 -0.139236 0.052432
N  0.133599 0.076486 0.076712
C  -7.80023 -1.112274 -0.520083
C  -6.424337 -1.734207 -0.123529
C  -7.777776 0.32964 0.078878
C  -5.513459 -0.518205 -0.007945
C  -6.294304 0.669205 0.107896
C  -4.113402 -0.461149 0.011724
C  -5.666604 1.923305 0.243218
C  -3.468928 0.806307 0.142822
C  -4.254915 1.987608 0.257736
C  -2.008487 0.922923 0.162867
C  2.482284 -0.612514 0.00512
C  5.203347 -0.049742 -0.04479
C  3.412379 -1.547675 0.528478
C  2.948223 0.597839 -0.574465
C  4.793669 -1.269883 0.517107
C  4.328062 0.893801 -0.60256
C  1.023116 -1.008088 0.045851
H  -8.657155 -1.708812 -0.162896
H  -7.868787 -1.048563 -1.621977
H  -6.062458 -2.478789 -0.854321
H  -6.494763 -2.250173 0.85569
H  -8.187703 0.331062 1.110016
H  -8.378046 1.048645 -0.507062
H  -3.493483 -1.359625 -0.075663
H  -6.260029 2.840484 0.330555
H  -3.754043 2.959409 0.355118
H  -1.594036 1.94729 0.276203
H  3.030394 -2.490269 0.931957
H  2.252492 1.300436 -1.046738
H  5.52741 -1.978265 0.913512
H  4.712788 1.809647 -1.061562
H  0.509669 1.029783 0.195313
H  8.032158 1.425945 1.747679
