program: Gaussian 09
title: 000291973
version: EM64L-G09RevD.01
frameworkgroup: C1[X(C8H14O4)]
method: RPBEPBE
basis: SDD
operation: Freq
keyword: #pfreq=noraman
keyword: PBEPBE/SDD
title: #p freq=noraman PBEPBE/SDD
converged: YES YES NO NO
title: Mulliken charges:
elementType: O O O O C C C C C C C C H H H H H H H H H H H H H H
charge: -0.266308 -0.413892 -0.223875 -0.220491 -0.062889 -0.253298 -0.715839 -0.715846 0.238892 0.157865 -0.259425 -0.663570 0.226400 0.276148 0.204773 0.221971 0.260344 0.215429 0.247397 0.208010 0.225714 0.238020 0.220325 0.247867 0.226929 0.379349
chargesum: 0.00000
title: Mulliken charges with hydrogens summed into heavy atoms:
elementType: O O O O C C C C C C C C
charge: -0.266308 -0.034543 -0.223875 -0.220491 0.163511 0.022850 -0.028752 -0.045010 0.238892 0.157865 0.204309 0.031552
polarizability: 1.13286564e+02 3.12164280e-01 9.65313866e+01 3.74759401e+00 -3.02763787e-01 8.52769147e+01
1716.lowfreq: -8.6620 -1.5888 0.0007 0.0009 0.0011 12.0161 23.8876 50.8391 58.1999
frequency: 21.9996 50.8270 58.1843 82.9165 91.0159 135.5405 172.3083 177.4022 205.4153 216.4585 230.9418 278.8737 303.2392 331.6689 335.1409 406.4642 426.9520 491.0477 533.6255 624.0617 638.4874 678.3607 714.1872 789.8934 809.7460 827.8599 883.0165 924.1356 931.9841 963.6162 976.2539 1015.9998 1050.1901 1090.8954 1098.0476 1129.8197 1144.9421 1157.5665 1192.9704 1238.8609 1257.8624 1277.5636 1300.4287 1327.5637 1354.1019 1361.6279 1383.0939 1390.9039 1403.5784 1458.1979 1462.3621 1466.0707 1480.5159 1481.6891 1484.9209 1496.8044 1637.6377 1673.1630 2976.9364 2986.5587 2992.7051 2993.3319 3026.0607 3032.2139 3067.4381 3075.3131 3088.5389 3089.8385 3093.5406 3103.7403 3120.3711 3514.9441
redmass: 4.2446 3.4129 5.1719 3.9962 3.0115 3.3732 4.0069 3.3097 1.2824 1.1782 1.0806 3.5707 2.6808 4.1021 4.4505 2.5444 3.7206 3.2825 2.5323 2.0845 2.7348 4.5903 3.7552 3.7472 1.3043 3.5034 3.2127 2.5278 1.2375 1.5774 2.4570 2.9291 2.0422 2.1783 2.0309 3.0097 1.9041 1.6782 2.1058 1.4141 1.6816 1.1201 1.6282 1.4529 1.2793 1.5896 1.2022 1.2305 1.2095 1.0840 1.0517 1.0417 1.0473 1.0520 1.0503 1.0547 9.1044 8.9358 1.0370 1.0447 1.0725 1.0382 1.0821 1.0596 1.0990 1.0988 1.0974 1.0998 1.1028 1.0992 1.1066 1.0641
irintensity: 0.4278 0.7604 1.2407 0.1800 0.7517 0.9638 3.1244 2.3105 0.8743 0.0983 0.1059 3.5597 5.4444 1.1019 8.5741 4.4060 3.1298 20.6116 25.1953 89.8932 59.8051 19.4338 9.3753 5.8586 3.3974 3.7693 5.7383 20.8036 8.7168 7.5107 56.7280 72.2076 170.5418 160.6647 28.4615 148.4726 21.2878 17.6262 23.9494 13.0325 82.4700 4.1407 61.6201 8.7273 2.5283 20.6151 18.8701 22.9117 25.5973 16.5061 12.5196 5.6285 11.4169 12.2748 8.9112 14.8503 143.0017 208.6352 36.5687 20.1703 10.8311 23.4544 3.6317 28.9690 24.7537 52.8534 35.6652 15.4591 1.8279 19.8953 30.0988 26.5642
temp: 298.150 k
press: 1.00000 atm
elementType: 8 8 8 8 6 6 6 6 6 6 6 6 1 1 1 1 1 1 1 1 1 1 1 1 1 1
symmnumber: 1
zpe: 558001.3 jmol-1
zpe.correction: 0.212531 hartree
zpe.thermalcorrener: 0.226866 hartree
zpe.thermalcorrenthalpy: 0.227811 hartree
zpe.thermalcorrgfe: 0.170233 hartree
zpe.sumelectzpe: -613.195046 hartree
zpe.sumelectthermal: -613.180711 hartree
zpe.sumelectthermalent: -613.179767 hartree
zpe.sumelectthermalfe: -613.237345 hartree
dipole: -1.8287 0.7340 -2.0575
dipole: 2.8489
quadrupole: -64.6800 -67.9131 -77.1091
quadrupole: -3.7129 -2.2225 1.3239
quadrupole: 5.2207 1.9877 -7.2084 -3.7129 -2.2225 1.3239
hfenergy: -613.4075778 hartree
pointgroup: C01 [X(C8H14O4)]
dipole: -0.701668 0.400117 -0.777074 debye
dipolederiv: -1.4648508 0.1293621 -0.268819 0.1265939 -0.3936834 0.1283912 -0.3610022 0.1405429 -0.5650989 -0.3645157 0.079453 0.1386031 0.0562712 -1.0199938 -0.4576131 0.1083467 -0.4235611 -0.5664121 -0.6543353 -0.1449433 0.0530599 0.0829485 -0.5850127 0.2870057 -0.1504134 0.3182477 -0.5901226 -0.6506122 -0.0838023 -0.3207827 0.1763744 -0.5981889 -0.0670754 -0.2540235 -0.2897258 -0.6452866 0.042199 -0.0069088 -0.0000499 0.1394523 0.317472 0.0236093 0.0374729 0.0722997 0.1409213 -0.436391 -0.0459633 -0.0473389 -0.1621445 -0.1901976 0.0209508 -0.0828458 0.0472126 0.0112073 0.0384242 -0.0119456 0.046311 -0.0103645 0.0026076 -0.0091934 0.0042575 -0.022453 -0.1077365 -0.0160069 -0.033323 0.0213137 -0.1010142 -0.0289558 0.0058933 0.0212782 -0.021547 0.0416666 1.6391103 0.151895 0.2452206 -0.1373993 0.5994031 -0.4649383 0.496285 -0.526166 0.7932284 0.8478574 -0.201835 0.3533572 -0.4061655 1.2312179 0.4925218 0.4004297 0.6074589 0.8635117 0.855348 -0.0287347 0.0467817 0.0963521 0.265721 0.0798842 -0.1020469 0.0341205 0.2984789 -0.1102951 0.0369427 0.0232421 0.0100043 -0.0052795 -0.1057932 0.0846889 -0.0625883 -0.065709 -0.0659987 0.069014 -0.065631 0.0768634 -0.0032027 0.0266667 -0.0617522 0.0253086 -0.0149954 0.0737132 0.0193534 0.0099397 0.0366999 0.0800685 -0.0120935 0.0133031 -0.0203281 -0.0468368 0.0965064 -0.0031684 -0.0003624 -0.0075064 -0.1733065 -0.1040144 -0.0057373 -0.0587449 0.0540009 -0.1183698 -0.0778752 0.0828887 -0.09417 0.0599295 0.0464862 0.0718104 0.0379341 0.0395159 -0.0029429 0.0368985 -0.0923104 0.0559948 0.088984 0.0701371 -0.037061 0.0461046 0.0599763 0.0580516 -0.0016113 0.0121626 -0.0458857 -0.1802871 -0.0437465 0.0085911 -0.0707627 0.0841481 -0.0402068 0.0466667 -0.0357351 0.0971715 0.0872434 0.0465303 -0.0878527 0.0349069 0.0485166 0.0576205 -0.0103926 0.02573 -0.0041769 0.094045 -0.0421745 0.0704974 0.0027332 -0.1828306 -0.041886 0.0040178 -0.0563378 0.0078782 0.0996967 0.0142422 -0.0736482 -0.0228491 -0.1080584 0.0025256 0.0488766 -0.0003215 -0.0498311 -0.0936664 -0.0087032 0.0676984 0.0489304 0.0816738 -0.1731629 -0.0532109 0.027276 -0.0529062 0.0834177 -0.0013679 0.0453337 -0.0131201 0.1150223 0.0816762 0.0145206 -0.1099736 0.0376598 0.0790409 0.0158767 -0.0850077 -0.0100205 -0.0671642 0.1278739 -0.0263164 0.0196753 0.0158889 -0.1269901 0.0328743 0.0173487 0.064747 0.0562751 0.2186678 0.0930302 -0.1078992 0.0554109 0.309917 0.0256437 -0.1459504 0.0613196 0.2721078 unknown
polarizability: 112.8105867|0.4041678|96.2290609|5.0979591|2.0865431|86.0552181 unknown
InChI: InChI=1S/C8H14O4/c1-4-12-8(11)6(5(2)3)7(9)10/h5-6,9H,4H2,1-3H3
charge 0 multiplicity 1
26 atoms
O  -1.669825 0.016548 -1.01677
O  1.819235 -1.961022 -0.827388
O  -0.912915 -1.327957 0.736961
O  2.596568 -0.609936 0.887684
C  0.756269 1.595464 -0.009003
C  0.669226 0.118717 -0.531714
C  0.559043 1.716182 1.520391
C  2.07609 2.26171 -0.46575
C  -0.686224 -0.505742 -0.176917
C  1.787726 -0.800297 -0.042537
C  -3.078094 -0.421181 -0.748838
C  -3.728281 0.470047 0.31232
H  -0.082888 2.119502 -0.509438
H  0.729641 0.144012 -1.63612
H  0.565361 2.781904 1.813428
H  -0.40277 1.280762 1.847907
H  1.36934 1.200646 2.061795
H  2.067316 3.334955 -0.201867
H  2.946072 1.797831 0.030598
H  2.214058 2.184791 -1.561197
H  -3.567289 -0.324449 -1.730975
H  -3.058961 -1.478667 -0.432384
H  -4.790268 0.187304 0.435146
H  -3.227374 0.349513 1.287569
H  -3.687087 1.53234 0.015623
H  2.512031 -2.581674 -0.472223
