program: Gaussian 09
title: 000291965
version: EM64L-G09RevD.01
frameworkgroup: C1[X(C7H12O2)]
method: RPBEPBE
basis: SDD
operation: Freq
keyword: #pfreq=noraman
keyword: PBEPBE/SDD
title: #p freq=noraman PBEPBE/SDD
converged: YES YES NO NO
title: Mulliken charges:
elementType: O O C C C C C C C H H H H H H H H H H H H
charge: -0.262175 -0.258795 -0.046105 -0.487553 -0.480717 -0.431817 -0.370056 0.304681 -0.754036 0.239586 0.229072 0.211501 0.240909 0.226913 0.224159 0.211566 0.236034 0.223394 0.246594 0.251114 0.245732
chargesum: 0.00000
title: Mulliken charges with hydrogens summed into heavy atoms:
elementType: O O C C C C C C C
charge: -0.262175 -0.258795 0.193481 -0.046981 -0.012895 0.003908 0.089372 0.304681 -0.010595
polarizability: 9.71929574e+01 -4.53863496e+00 7.46268183e+01 -3.17706408e+00 -1.48768967e+00 6.71349337e+01
1716.lowfreq: -40.8220 -16.2310 -8.3244 -0.0013 -0.0011 -0.0011 7.1944 40.5249 57.6519
frequency: -40.7851 39.9155 57.6125 81.0173 126.2089 205.7475 288.9029 319.3543 395.7867 462.6625 572.0572 611.9793 634.5250 754.7320 776.1213 793.0379 871.1291 895.6285 929.7236 945.0169 965.5584 969.4015 1000.7729 1042.2357 1051.6086 1115.0439 1162.7388 1176.5171 1191.8918 1204.4341 1221.0825 1233.7687 1243.7419 1248.3567 1268.2383 1327.4664 1361.4426 1382.5675 1452.2131 1455.9344 1456.5134 1458.5047 1464.1856 1481.3444 1643.1023 3004.5020 3008.2804 3010.9132 3016.5539 3018.6542 3025.2798 3075.0009 3085.9224 3087.7617 3096.3749 3105.9292 3140.3122
redmass: 1.0619 3.6975 4.4491 2.6148 2.0908 4.0798 2.7966 4.1416 1.9037 3.3444 3.2041 4.2697 2.1494 1.5847 2.0988 1.6314 2.2545 1.8106 2.9408 3.1149 1.2827 2.5662 1.8666 1.8094 2.1006 2.3856 2.1043 1.3161 2.6840 1.5044 1.1297 1.3001 1.3887 1.3836 1.3297 1.3592 1.4115 1.2341 1.0894 1.0815 1.0836 1.0466 1.0857 1.1254 9.6192 1.0593 1.0364 1.0637 1.0582 1.0783 1.0641 1.1059 1.1073 1.1081 1.0972 1.1067 1.1012
irintensity: 1.4495 1.9731 1.2159 1.1282 1.5111 3.6616 9.6020 4.5669 1.6090 7.5510 2.2573 5.8016 10.2941 2.4362 11.6856 3.0947 2.1612 2.7814 41.5045 9.2326 0.3846 29.0827 49.4040 6.4275 7.3409 5.0509 1.8271 0.9918 253.5657 73.7285 0.8639 2.0714 9.4666 7.8517 4.5075 2.7722 0.3644 50.1417 12.9430 8.5617 14.0257 15.1349 9.4753 4.2361 174.2648 30.1609 3.0706 35.5855 48.7138 33.1058 20.9296 17.6628 29.6777 2.8955 7.5860 80.0550 9.7864
temp: 298.150 k
press: 1.00000 atm
elementType: 8 8 6 6 6 6 6 6 6 1 1 1 1 1 1 1 1 1 1 1 1
symmnumber: 1
zpe: 466635.2 jmol-1
zpe.correction: 0.177732 hartree
zpe.thermalcorrener: 0.186996 hartree
zpe.thermalcorrenthalpy: 0.187941 hartree
zpe.thermalcorrgfe: 0.142027 hartree
zpe.sumelectzpe: -423.647598 hartree
zpe.sumelectthermal: -423.638333 hartree
zpe.sumelectthermalent: -423.637389 hartree
zpe.sumelectthermalfe: -423.683302 hartree
dipole: -0.4861 1.1063 -1.3013
dipole: 1.7758
quadrupole: -49.2412 -56.2417 -56.0072
quadrupole: 0.0200 -3.4248 3.6347
quadrupole: 4.5888 -2.4117 -2.1771 0.0200 -3.4248 3.6347
hfenergy: -423.8253296 hartree
pointgroup: C01[X(C7H12O2)]
dipole: 0.2001209 0.1661237 -0.6484405 debye
dipolederiv: -1.1987155 0.2522196 0.3408776 0.3620489 -0.4342625 -0.1527721 0.4990497 -0.1236183 -0.7838986 -0.6023769 0.1342848 -0.0949841 0.0763619 -0.4231594 0.2047755 0.2147482 0.0549632 -0.934545 -0.0415457 0.0842432 -0.0247068 0.0793558 0.0152777 -0.1217475 -0.0084938 -0.0296002 0.1047619 0.0073457 0.0101796 -0.1029629 -0.0681453 0.0535249 -0.0135544 -0.0794762 -0.085972 0.0967042 -0.0491182 -0.0382427 -0.0229566 -0.0076019 0.123049 -0.0673078 -0.0324557 -0.0338319 -0.0191607 0.0258952 0.0166136 0.052015 0.0495811 0.0615681 -0.0764522 0.0156309 -0.0898312 0.1455338 0.7392547 -0.107916 -0.0825258 -0.1852498 0.3426533 0.13761 0.0272722 -0.0073697 0.1979888 1.2026522 -0.4768954 -0.20197 -0.4856297 0.4826415 -0.115708 -0.7064924 0.0443715 1.4006834 -0.3125973 0.2040318 -0.0373594 0.2375533 -0.1105211 0.0339288 0.0344126 -0.0017725 0.0004704 0.042646 -0.0163356 -0.0101803 -0.0325073 -0.0242648 0.0968479 -0.0203714 0.089958 -0.0956865 -0.0524115 0.0536418 0.1078694 0.0347443 0.0455487 -0.0459978 0.1296609 -0.0811168 -0.0983919 0.0746304 -0.0549713 0.0232209 -0.0128526 -0.1354286 0.0631777 0.005323 0.1050897 0.0183558 0.0407346 -0.0196799 0.0825542 -0.03361 0.0315632 0.0794315 0.0850242 0.0416407 -0.0320995 0.0383487 0.0735295 0.0081256 0.0657066 -0.173133 -0.0428082 -0.0082666 -0.0067009 0.0674992 -0.040336 0.0141012 -0.1037118 0.0408434 0.0562412 0.0507623 -0.1608832 0.023931 -0.1080105 -0.0353715 -0.0887725 0.0366234 -0.1263025 -0.0605998 0.057501 0.0809769 0.0796355 0.0200345 0.0052815 0.008706 0.0169604 0.0286065 0.0180669 0.0283999 -0.0274286 0.1358309 -0.0051248 -0.023848 0.0114946 -0.0021496 0.02377 -0.0155381 -0.111674 -0.0167281 -0.1396087 -0.0471111 -0.0335101 -0.047467 0.0352716 -0.0889064 0.0662606 0.0425895 0.0412285 0.060324 0.0952358 0.1102281 0.0117918 0.0105208 0.0149343 0.1104499 0.0244427 -0.0387765 0.050865 -0.0815814 0.1028135 -0.0245569 -0.0305313 0.0272995 -0.0299376 -0.0714449 -0.0339544 -0.0871874 0.0583421 unknown
polarizability: 95.9538642|-7.71456|69.2633547|-1.9921625|3.1467818|73.7374905 unknown
InChI: InChI=1S/C7H12O2/c1-6(8)9-5-7-3-2-4-7/h7H,2-5H2,1H3
charge 0 multiplicity 1
21 atoms
O  -1.177939 -0.090106 -0.870413
O  -1.663688 -0.208916 1.41528
C  1.295144 -0.006463 -0.607856
C  2.674921 -0.735738 -0.406778
C  1.581697 0.817395 0.699374
C  3.091077 0.403656 0.589426
C  0.063996 -0.903879 -0.669733
C  -1.947664 0.194255 0.263484
C  -3.152404 1.035689 -0.103264
H  1.322304 0.645426 -1.500879
H  3.300073 -0.886981 -1.302212
H  2.552274 -1.705617 0.110306
H  1.081967 0.369283 1.575498
H  1.349987 1.894685 0.672432
H  3.595764 0.094494 1.519054
H  3.701385 1.180496 0.096071
H  -0.046893 -1.498301 0.255566
H  0.09362 -1.568576 -1.550734
H  -4.070803 0.522709 0.230481
H  -3.198143 1.219648 -1.185948
H  -3.102276 1.998139 0.435445
