program: Gaussian 09
title: 000292002
version: EM64L-G09RevD.01
frameworkgroup: C1[X(C16H15NO3)]
method: RPBEPBE
basis: SDD
operation: Freq
keyword: #p
keyword: freq=noraman
keyword: PBEPBE/SDD
title: #p freq=noraman PBEPBE/SDD
converged: YES YES NO NO
title: Mulliken charges:
elementType: O O O N C C C C C C C C C C C C C C C C H H H H H H H H H H H H H H H
charge: -0.259789 -0.289098 -0.249911 -0.229947 0.323902 0.115828 0.083969 -0.322093 0.280071 -0.642123 -0.323367 -0.217675 -0.240267 -0.381332 -0.322997 0.155127 -0.225918 -0.232365 -0.231913 -0.499721 0.260959 0.273068 0.217673 0.272186 0.276108 0.235538 0.235861 0.264643 0.265999 0.229396 0.228855 0.229044 0.243046 0.234113 0.243134
chargesum: 0.00000
title: Mulliken charges with hydrogens summed into heavy atoms:
elementType: O O O N C C C C C C C C C C C C C C C C
charge: -0.259789 -0.289098 -0.249911 -0.229947 0.323902 0.115828 0.083969 -0.061135 0.280071 0.120803 -0.047259 0.017863 -0.004406 -0.116690 -0.056998 0.155127 0.003478 -0.003510 -0.002870 0.220571
polarizability: 2.37480661e+02 1.37578445e+00 1.85531462e+02 1.54042610e+01 6.76328436e+00 1.50226762e+02
1716.lowfreq: -37.6089 -0.0003 0.0004 0.0005 2.7344 4.9586 8.7927 33.2083 45.0784
frequency: -36.7259 32.9024 45.0736 47.5879 55.3533 80.9909 97.8843 109.8682 131.4727 146.6935 175.8521 194.9432 226.1503 232.7843 294.7665 316.6958 330.2014 360.1162 374.9435 401.4956 407.3193 435.7037 473.0118 511.8421 532.7059 575.1160 613.7881 633.6822 654.4773 684.3339 689.3322 705.2067 712.1109 764.8309 773.2258 781.9905 790.8935 853.9961 857.8258 885.5710 920.0858 937.0897 970.5416 983.3242 988.2964 991.6842 996.5397 1000.9945 1027.2189 1040.7202 1047.6422 1083.1498 1094.2766 1113.7980 1119.8493 1130.0198 1146.4894 1172.6620 1176.4095 1179.9409 1188.9526 1232.3966 1265.1328 1301.3166 1315.7350 1320.9506 1378.8996 1384.0183 1414.1105 1423.0398 1433.8141 1435.2482 1451.7916 1457.9089 1464.2558 1474.2351 1480.1938 1496.3851 1555.0344 1576.7379 1591.8515 1600.1073 1609.5366 1618.7363 3000.4487 3004.1097 3097.1043 3105.4595 3115.0487 3126.2107 3136.4494 3136.8964 3148.0895 3148.6496 3153.4129 3157.1567 3166.7339 3167.6484 3182.7843
redmass: 1.3009 3.4435 5.3318 3.7976 6.1518 5.0179 2.1873 1.4627 3.7484 3.1083 4.4284 4.1529 4.4351 5.2425 4.7398 5.0560 5.0498 4.8485 5.4251 4.1344 3.0873 4.2328 5.6194 4.6382 4.6344 3.9052 6.4081 6.4211 6.1984 4.5490 5.4842 1.6262 5.3289 4.3799 2.3156 2.1135 2.3804 4.2273 1.2467 1.4519 7.1090 1.4702 1.3964 1.4082 5.5406 4.0438 1.3608 1.4337 2.3125 6.3362 2.1181 1.6006 1.7932 1.2683 1.5800 1.7083 1.4675 1.0707 1.1323 1.9514 1.1773 3.8771 1.8201 2.5543 1.7769 2.4543 8.7087 8.6381 1.3351 1.1919 2.2439 1.8860 1.0499 1.0822 1.0551 2.3062 2.3134 1.1439 7.0800 7.2874 6.5711 6.7381 6.0131 8.7281 1.0320 1.0296 1.1020 1.1044 1.1024 1.0849 1.0882 1.0863 1.0926 1.1047 1.0910 1.0965 1.0968 1.1014 1.0971
irintensity: 0.2365 0.3261 1.8227 0.1453 2.1789 2.1462 3.1785 1.0380 0.7114 5.7728 0.1788 8.6592 2.7266 2.4010 0.8385 6.1761 6.4883 3.0188 12.3124 3.8707 1.8983 6.2715 0.4557 3.3264 1.2124 19.0357 0.1738 4.0985 16.6145 29.0167 5.0866 69.0037 13.1321 11.3524 32.3966 23.9988 40.2590 2.1448 1.6197 0.9765 8.7217 5.6440 1.7260 4.0116 7.7764 16.8984 1.0116 1.6441 14.8610 201.2091 85.5091 15.8408 47.7209 0.2195 28.1290 20.6837 68.0715 1.2415 5.5063 8.7773 6.4525 346.2722 31.6902 52.8340 89.8783 156.1449 5.0481 4.4748 36.7719 25.8883 8.2620 29.7385 14.3097 10.0926 19.0048 103.3688 1.4174 55.8888 224.9170 37.1618 43.0620 29.5057 4.9026 164.7868 35.0809 40.3153 10.3662 24.4933 5.5005 0.1299 6.8688 1.7690 14.6674 16.6803 13.6450 19.8191 11.6140 19.6611 8.7741
temp: 298.150 k
press: 1.00000 atm
elementType: 8 8 8 7 6 6 6 6 6 6 6 6 6 6 6 6 6 6 6 6 1 1 1 1 1 1 1 1 1 1 1 1 1 1 1
symmnumber: 1
zpe: 714350.4 jmol-1
zpe.correction: 0.272082 hartree
zpe.thermalcorrener: 0.289863 hartree
zpe.thermalcorrenthalpy: 0.290808 hartree
zpe.thermalcorrgfe: 0.225060 hartree
zpe.sumelectzpe: -897.708024 hartree
zpe.sumelectthermal: -897.690242 hartree
zpe.sumelectthermalent: -897.689298 hartree
zpe.sumelectthermalfe: -897.755045 hartree
dipole: 2.7999 4.2801 0.6025
dipole: 5.1499
quadrupole: -99.0189 -119.4198 -110.2053
quadrupole: -11.2187 2.9399 -1.3895
quadrupole: 10.5291 -9.8718 -0.6573 -11.2187 2.9399 -1.3895
hfenergy: -897.9801055 hartree
pointgroup: C01 [X(C16H15N1O3)]
dipole: 1.1205109 0.5212484 1.6056141 debye
polarizability: 226.3611579|-28.8100957|164.3931181|16.5278089|9.6290203|182.4846085 unknown
InChI: InChI=1S/C16H15NO3/c1-17(15(18)12-8-4-3-5-9-12)14-11-7-6-10-13(14)16(19)20-2/h3-11H,1-2H3
charge 0 multiplicity 1
35 atoms
O  -1.646217 -0.001677 -2.912864
O  3.481252 -1.503161 0.772752
O  1.601118 -2.113637 -0.450156
N  0.169183 0.206792 -1.464025
C  0.71054 0.769169 -0.260833
C  1.788688 0.162802 0.461298
C  -1.213866 0.107186 -1.722979
C  0.221081 2.030742 0.17084
C  -2.15683 0.05794 -0.550833
C  1.084506 -0.086988 -2.595291
C  2.368177 0.861321 1.557888
C  0.780844 2.689087 1.281744
C  1.873013 2.110658 1.972089
C  -3.427119 0.673616 -0.684076
C  -1.8559 -0.681984 0.621756
C  2.23606 -1.232711 0.183013
C  -4.369691 0.591206 0.3622
C  -2.808095 -0.778954 1.659354
C  -4.060641 -0.132434 1.538924
C  3.965756 -2.893873 0.615838
H  -0.589394 2.498716 -0.396321
H  1.302759 -1.1669 -2.64395
H  2.022586 0.47638 -2.465552
H  0.584619 0.222131 -3.527583
H  3.199497 0.389447 2.08765
H  0.38347 3.661985 1.590774
H  2.3282 2.627582 2.822961
H  -3.663838 1.196664 -1.616691
H  -0.898217 -1.206934 0.701819
H  -5.345363 1.078692 0.258291
H  -2.576722 -1.363286 2.556796
H  -4.795678 -0.203684 2.34868
H  3.256326 -3.602086 1.076318
H  4.936199 -2.911005 1.131281
H  4.078197 -3.142005 -0.452913
