program: Gaussian 09
title: 000291968
version: EM64L-G09RevD.01
frameworkgroup: C1[X(C7H12O4)]
method: RPBEPBE
basis: SDD
operation: Freq
keyword: #pfreq=noraman
keyword: PBEPBE/SDD
title: #p freq=noraman PBEPBE/SDD
converged: YES YES NO NO
title: Mulliken charges:
elementType: O O O O C C C C C C C H H H H H H H H H H H H
charge: -0.417077 -0.233316 -0.413537 -0.240186 -0.115518 -0.418389 -0.388363 -0.506623 0.134556 -0.703908 0.202059 0.275482 0.227287 0.231299 0.218609 0.207778 0.258915 0.269508 0.229090 0.215010 0.218591 0.372276 0.376458
chargesum: 0.00000
title: Mulliken charges with hydrogens summed into heavy atoms:
elementType: O O O O C C C C C C C
charge: -0.044801 -0.233316 -0.037079 -0.240186 0.159964 0.040196 0.038024 0.021800 0.134556 -0.041216 0.202059
polarizability: 9.50906548e+01 4.09445799e+00 8.57578752e+01 -5.36976059e+00 8.80916861e-01 7.73373035e+01
1716.lowfreq: -24.2922 -8.1789 0.0007 0.0009 0.0010 3.9994 19.5551 30.5880 42.7640
frequency: 17.8537 30.0473 42.4128 68.3320 102.6116 155.9955 169.2181 209.6002 263.4165 277.1014 306.9996 391.0417 437.5712 492.7629 494.9518 578.5064 588.1579 625.2559 639.4791 716.6617 728.4269 775.4880 817.4717 881.4985 917.8407 972.8705 1007.6465 1035.9033 1046.3328 1058.4029 1101.2655 1106.4654 1125.0208 1179.7934 1216.8132 1237.5965 1257.7029 1269.6599 1286.9341 1329.7607 1337.6040 1368.4220 1380.3546 1395.4660 1435.1555 1453.2093 1463.6699 1479.3513 1486.1992 1658.4495 1666.5346 2979.3053 2987.4599 2997.7113 3005.7536 3035.6747 3048.3482 3055.9172 3070.5277 3078.2987 3079.9339 3494.5991 3513.5339
redmass: 8.4307 5.5640 9.2806 3.3472 2.5746 3.6698 2.7790 1.8156 1.9082 2.2259 3.6862 2.6490 4.0177 3.1595 2.0993 3.1594 3.6551 1.3050 1.3890 2.9553 2.4750 1.8347 2.1993 2.1316 1.7800 2.5335 2.3117 2.5319 2.4743 2.0850 1.7928 2.3877 2.3513 1.1690 1.3640 1.5122 1.5423 1.3583 1.1719 1.4687 1.3861 1.8133 1.6090 1.2262 1.0874 1.0836 1.0852 1.0480 1.0478 8.0041 7.9171 1.0357 1.0599 1.0607 1.0622 1.0952 1.0957 1.0943 1.1010 1.0989 1.1008 1.0637 1.0640
irintensity: 2.1209 0.6679 1.0009 0.4538 0.7285 0.5932 0.7709 0.5144 0.8666 3.9835 0.9989 3.4882 25.7985 35.0251 21.3737 10.0006 14.1699 154.4652 75.3481 48.2380 20.1922 2.9967 5.8680 15.6716 9.0343 7.8398 64.7180 63.2105 380.4054 1.6988 24.4107 32.7019 17.9790 5.2499 7.6222 1.1398 5.3677 15.2042 6.7689 6.4995 10.3621 24.4098 36.1007 15.6066 32.4007 3.3346 25.8604 12.5276 12.4682 208.1831 172.0077 30.7739 19.4417 20.9064 17.3630 4.0725 0.3422 9.4087 5.1408 43.6023 61.4044 17.0592 23.1899
temp: 298.150 k
press: 1.00000 atm
elementType: 8 8 8 8 6 6 6 6 6 6 6 1 1 1 1 1 1 1 1 1 1 1 1
symmnumber: 1
zpe: 487073.6 jmol-1
zpe.correction: 0.185517 hartree
zpe.thermalcorrener: 0.198181 hartree
zpe.thermalcorrenthalpy: 0.199125 hartree
zpe.thermalcorrgfe: 0.143947 hartree
zpe.sumelectzpe: -573.983689 hartree
zpe.sumelectthermal: -573.971025 hartree
zpe.sumelectthermalent: -573.970081 hartree
zpe.sumelectthermalfe: -574.025259 hartree
dipole: 1.3010 0.3592 -0.0626
dipole: 1.3512
quadrupole: -64.7392 -66.4464 -64.4738
quadrupole: 4.1493 2.1482 -5.7961
quadrupole: 0.4806 -1.2266 0.7460 4.1493 2.1482 -5.7961
hfenergy: -574.1692059 hartree
pointgroup: C01 [X(C7H12O4)]
dipole: -0.508755 -0.1527808 -0.020242 debye
dipolederiv: -0.5112864 -0.195343 -0.2018956 -0.2817438 -0.5325127 -0.407718 -0.2125078 -0.3503295 -0.7912315 -0.6319921 0.0486789 -0.2789856 0.254489 -0.6471383 0.1368649 -0.2640021 -0.0377893 -0.602817 -1.0780713 -0.4217441 -0.0782095 -0.4242383 -0.5875188 -0.1575029 -0.1864276 -0.2028407 -0.3518079 -0.6443913 -0.0510033 -0.1345322 -0.2720961 -0.7624503 0.176225 0.0064944 0.3218404 -0.529563 -0.1111435 0.0463584 0.031688 0.0362164 -0.1643147 -0.0807141 0.0812398 -0.0944815 -0.0089431 0.1640171 -0.0683171 -0.0018412 -0.0064257 0.0308283 0.022186 -0.0677369 0.0595985 0.1500185 0.0986087 0.0719589 0.0198889 0.0306142 0.1421431 -0.0301914 0.034576 0.0136865 0.1024484 -0.0531009 -0.0289178 -0.0721344 0.0519046 -0.0122613 0.135374 -0.150281 0.1271423 -0.1604005 0.7108664 -0.0623964 0.5651693 -0.1828469 1.1136363 0.2735337 0.5826078 0.3349547 0.9263807 -0.0277313 -0.0322413 0.0675377 -0.0389106 0.0527286 0.0003828 0.0575123 -0.015322 0.0229012 1.2777625 0.4343439 0.3692993 0.5949094 1.0122254 -0.2453025 0.3966608 -0.3198572 0.696253 0.0890288 0.0016974 -0.0513729 -0.0095214 0.0431794 0.0100161 -0.0652319 0.0099272 -0.0467071 0.0449389 0.0465167 0.0252767 0.024927 -0.1145606 -0.0436546 0.0532908 -0.0194972 0.08094 -0.0097814 0.011198 -0.0965697 0.0120849 0.0798409 0.0591137 -0.0444138 0.0244075 -0.0828377 0.0159039 -0.0207925 -0.041559 0.0175111 0.080697 0.0738877 -0.0613064 0.0218905 -0.1156605 0.0074446 0.0791258 0.0400396 0.0705684 -0.139087 -0.0436854 0.0317864 -0.0352651 0.062442 -0.0542647 0.0045145 0.0787192 0.0000241 0.1181398 -0.0146051 0.0822752 0.0056293 -0.0100117 0.0880259 0.0272872 -0.0448965 -0.0000714 -0.0578332 -0.0240585 -0.0440652 -0.0472039 0.0961892 0.0606544 0.0760616 0.0223473 0.1179886 -0.1115365 -0.0403479 0.0114393 -0.008572 0.0648192 0.0289635 0.0421473 -0.1156556 0.0243003 0.0819723 0.0410176 -0.0489417 0.0502464 -0.1161047 -0.093914 -0.143614 0.0067794 -0.1574862 -0.0226049 -0.0093629 -0.0117402 -0.0283763 0.0753653 0.2950233 0.1204942 -0.0468678 0.0914713 0.1408207 0.0271976 -0.0831047 0.0744133 0.3281214 0.334439 0.0139865 -0.0622254 0.0463311 0.2556065 0.1413443 -0.0981236 0.1157979 0.2102057 unknown
polarizability: 94.7809965|4.6899053|85.7562275|5.2891368|-1.3489611|77.6486096 unknown
InChI: InChI=1S/C7H12O4/c1-2-5(7(10)11)3-4-6(8)9/h5,8,10H,2-4H2,1H3
charge 0 multiplicity 1
23 atoms
O  0.680974 -1.78939 -1.009379
O  2.115663 -1.595399 0.80188
O  -3.460709 -0.528456 -0.41424
O  -2.148661 1.334123 -0.850731
C  0.834423 0.391157 0.046066
C  -0.215433 0.567066 1.186828
C  2.041559 1.341622 0.260295
C  -1.524784 -0.220486 0.982054
C  1.302734 -1.055894 0.017599
C  3.066191 1.305342 -0.892875
C  -2.356561 0.302257 -0.174799
H  0.348234 0.619277 -0.918491
H  -0.449695 1.645402 1.254009
H  0.244582 0.264142 2.146483
H  2.540321 1.076845 1.212567
H  1.644124 2.369117 0.371775
H  -2.155343 -0.163036 1.890964
H  -1.342938 -1.297478 0.811035
H  3.522674 0.303388 -0.991871
H  2.591912 1.563678 -1.858001
H  3.884158 2.026282 -0.713794
H  1.007193 -2.731194 -0.982229
H  -3.989717 -0.158761 -1.172645
