program: Gaussian 09
title: 000292011
version: EM64L-G09RevD.01
frameworkgroup: C1[X(C19H17NO3)]
method: RPBEPBE
basis: SDD
operation: Freq
keyword: #p
keyword: freq=noraman
keyword: PBEPBE/SDD
title: #p freq=noraman PBEPBE/SDD
converged: YES YES NO NO
title: Mulliken charges:
elementType: O O O N C C C C C C C C C C C C C C C C C C C H H H H H H H H H H H H H H H H H
charge: -0.210268 -0.216112 -0.245749 -0.245331 0.298943 -0.557456 -0.446049 -0.543973 0.287242 0.451823 -0.299697 -0.576665 -0.429846 -0.369107 0.413941 0.050042 0.146525 0.211842 -0.333005 -0.336287 -0.220563 -0.816152 -0.242001 0.228464 0.229706 0.220769 0.225008 0.229642 0.229770 0.276368 0.256750 0.245015 0.270324 0.294062 0.273787 0.234590 0.255049 0.245590 0.275205 0.237805
chargesum: 0.00000
title: Mulliken charges with hydrogens summed into heavy atoms:
elementType: O O O N C C C C C C C C C C C C C C C C C C C
charge: -0.210268 -0.216112 -0.245749 -0.245331 0.298943 -0.099287 -0.000272 -0.084561 0.287242 0.451823 -0.023328 -0.319915 -0.184831 -0.098783 0.413941 0.050042 0.146525 0.211842 -0.038943 -0.062500 0.014028 -0.040309 -0.004196
polarizability: 2.11394785e+02 -1.41685888e+00 2.18765440e+02 -6.94321280e+00 1.06156145e+01 2.10701483e+02
1716.lowfreq: -12.3156 -6.1751 -0.0006 -0.0003 0.0004 4.6070 24.9042 28.5204 48.6324
frequency: 24.8456 28.4972 48.6184 53.8879 67.4313 96.4065 121.3260 161.4646 169.5771 198.6511 210.0380 213.9436 237.3095 276.5350 294.5946 315.2032 331.5648 367.5534 398.5120 415.8301 419.9925 423.8132 471.2670 502.6897 514.8603 526.6696 538.9261 556.5547 572.4467 610.6946 620.7662 633.6439 656.7805 677.6779 710.0749 735.0780 754.8069 761.0653 775.0437 780.9798 796.2268 846.3921 855.5577 870.4336 882.2278 898.9751 904.7694 914.9968 929.0564 948.6863 969.7611 973.6984 979.1705 997.8428 1014.5518 1019.4224 1032.1375 1043.4903 1049.2182 1087.9645 1109.1200 1110.0550 1128.8194 1154.5272 1166.5291 1176.6046 1199.7184 1210.1960 1215.4300 1221.6524 1244.4258 1261.7744 1270.1486 1285.2995 1288.0536 1294.8107 1302.0911 1317.6277 1360.4820 1380.4681 1387.3458 1393.6251 1425.9580 1446.7521 1458.0690 1458.7374 1460.3220 1474.8272 1477.2755 1481.0108 1488.5400 1581.4100 1589.7052 1600.3042 1616.2613 1624.0892 1658.0977 2974.7358 2976.7614 2990.0986 3006.0917 3045.1047 3048.2769 3076.9971 3079.8121 3102.9802 3128.4243 3131.2457 3131.5933 3139.6153 3154.3276 3160.4202 3171.6496 3210.1276
redmass: 3.9284 4.6420 6.2111 6.3230 4.3261 4.0707 4.5004 2.3398 4.8957 4.5746 1.7933 1.3691 4.0328 5.4551 4.0484 6.1567 7.2756 4.3483 7.0362 3.1203 3.1723 4.3497 6.5748 4.3199 5.5413 3.8187 4.5757 3.6210 4.1771 3.7154 3.1515 4.3925 5.7086 4.6129 3.5506 5.0309 3.5694 3.0658 4.6040 1.6261 2.8409 2.0165 1.9408 1.5767 1.5718 3.4363 1.7783 2.3240 2.7759 4.2063 1.3842 2.2067 2.2774 1.3419 2.0756 2.3275 1.6764 2.1034 1.6845 2.8804 2.4360 2.6333 1.2853 1.6223 1.2478 1.0921 1.6510 1.5284 2.5561 2.3490 2.2966 1.3618 1.6516 2.2417 1.5014 1.4449 1.7676 1.4395 2.0476 1.6815 4.4973 2.7200 4.1140 2.5108 1.1101 1.1004 1.1656 2.2422 1.1025 1.1013 2.4604 7.1030 7.2918 6.9825 7.8004 7.1228 12.3899 1.0655 1.0651 1.0386 1.0651 1.0965 1.0937 1.0987 1.1039 1.0850 1.0910 1.0976 1.0893 1.0868 1.0915 1.0953 1.0991 1.0946
irintensity: 0.0744 0.1662 0.3094 0.5803 8.4019 0.7000 0.6565 0.4986 1.0194 2.7310 3.2094 1.0375 1.5002 5.8687 0.2682 2.2947 3.9624 2.4744 1.0303 1.8228 4.9042 2.1453 4.8144 4.7294 5.9655 2.8270 2.1454 4.7708 1.5543 1.1161 8.6795 4.2175 21.7101 20.1692 4.6140 11.5971 10.9846 25.7605 4.0905 51.1283 8.5802 15.7760 18.5074 12.8222 3.7811 53.8975 3.1958 2.8005 33.6749 28.7116 2.5249 75.7031 41.4360 0.1044 16.7957 1.6943 11.0466 3.7882 2.4951 12.5224 12.1895 47.1953 2.3159 15.3627 9.3520 2.7819 7.8708 2.3694 75.0890 69.1854 58.5252 52.6993 71.7830 30.0551 75.1675 8.0197 186.8859 10.4015 89.6480 49.2890 25.5704 14.0788 6.0227 41.0254 29.3405 16.2238 5.1884 82.3039 22.0045 6.9180 24.1433 2.6011 2.0682 93.6161 217.5585 5.6535 266.1344 23.5927 33.2388 4.6461 35.9618 20.2226 41.2128 8.6627 47.0537 4.9133 13.9148 8.5134 6.0232 4.4371 7.0941 4.1416 17.9031 1.0632
temp: 298.150 k
press: 1.00000 atm
elementType: 8 8 8 7 6 6 6 6 6 6 6 6 6 6 6 6 6 6 6 6 6 6 6 1 1 1 1 1 1 1 1 1 1 1 1 1 1 1 1 1
symmnumber: 1
zpe: 826252.5 jmol-1
zpe.correction: 0.314703 hartree
zpe.thermalcorrener: 0.333798 hartree
zpe.thermalcorrenthalpy: 0.334742 hartree
zpe.thermalcorrgfe: 0.266133 hartree
zpe.sumelectzpe: -1013.052137 hartree
zpe.sumelectthermal: -1013.033042 hartree
zpe.sumelectthermalent: -1013.032098 hartree
zpe.sumelectthermalfe: -1013.100707 hartree
dipole: 4.6094 1.7324 2.3076
dipole: 5.4381
quadrupole: -133.7566 -135.6506 -129.2918
quadrupole: 0.3519 -4.5029 -14.7117
quadrupole: -0.8569 -2.7510 3.6079 0.3519 -4.5029 -14.7117
hfenergy: -1013.3668399 hartree
pointgroup: C01 [X(C19H17N1O3)]
dipole: -1.7293758 0.4984981 -1.1568135 debye
polarizability: 212.7514503|1.976366|217.8782496|-6.024028|-11.2916643|210.232007 unknown
InChI: InChI=1S/C19H17NO3/c1-12(21)20-17-8-3-2-7-16(17)19(22)23-18(20)15-10-9-13-5-4-6-14(13)11-15/h2-3,7-11,18H,4-6H2,1H3
charge 0 multiplicity 1
40 atoms
O  1.011515 -0.261285 2.294437
O  2.01845 -2.320457 2.232033
O  2.416195 3.09567 -0.498026
N  1.260759 1.287835 0.437306
C  -2.718928 0.232996 -0.848464
C  -3.461585 0.612879 -2.123609
C  -4.907248 0.084266 -1.860939
C  -4.728626 -1.10869 -0.869229
C  -3.443828 -0.754852 -0.131126
C  -0.963067 0.185054 0.844496
C  0.326524 0.75551 1.444031
C  -1.482827 0.704491 -0.368817
C  -2.92911 -1.274292 1.073145
C  -1.691361 -0.796222 1.563304
C  1.854325 0.277354 -0.393929
C  1.992898 -1.029158 0.167692
C  1.683526 -1.300827 1.597445
C  1.59907 2.662693 0.361258
C  2.279655 0.516074 -1.723256
C  2.527627 -2.081924 -0.615377
C  2.811523 -0.545405 -2.484752
C  0.925058 3.606546 1.354853
C  2.932381 -1.847884 -1.941607
H  -3.435053 1.696333 -2.338633
H  -3.008285 0.098967 -2.995806
H  -5.430586 -0.205494 -2.788394
H  -5.502272 0.878036 -1.372071
H  -4.600524 -2.062581 -1.420396
H  -5.59508 -1.239689 -0.1963
H  0.09322 1.544441 2.171985
H  -0.920921 1.459704 -0.93085
H  -3.478568 -2.03859 1.634333
H  -1.280556 -1.187083 2.499871
H  2.206886 1.51853 -2.144568
H  2.631484 -3.066704 -0.14863
H  3.131633 -0.35154 -3.514375
H  1.232863 3.395087 2.39529
H  -0.177781 3.562236 1.302403
H  1.249268 4.625649 1.098974
H  3.346145 -2.661978 -2.545003
