program: Gaussian 09
title: 000292000
version: EM64L-G09RevD.01
frameworkgroup: C1[X(C17H19NOS)]
method: RPBEPBE
basis: SDD
operation: Freq
keyword: #p
keyword: freq=noraman
keyword: PBEPBE/SDD
title: #p freq=noraman PBEPBE/SDD
converged: YES YES NO NO
title: Mulliken charges:
elementType: S O N C C C C C C C C C C C C C C C C C H H H H H H H H H H H H H H H H H H H
charge: -0.053171 -0.322859 -0.142649 0.486912 -0.359672 -0.454340 0.347337 -0.510635 0.469987 -0.412017 -0.657109 0.227050 -0.431073 -0.200928 -0.330552 -0.812323 -0.360625 -0.241251 -0.215295 -0.518208 0.248250 0.221566 0.303469 0.246155 0.217585 0.222477 0.252509 0.234191 0.226986 0.238380 0.220720 0.240236 0.235916 0.240301 0.227593 0.226421 0.226911 0.251714 0.210042
chargesum: 0.00000
title: Mulliken charges with hydrogens summed into heavy atoms:
elementType: S O N C C C C C C C C C C C C C C C C C
charge: -0.053171 -0.322859 -0.142649 0.486912 0.110144 -0.454340 0.347337 -0.207166 0.469987 -0.165862 0.035462 0.227050 -0.196883 0.026058 -0.092172 -0.115451 -0.120323 -0.013659 0.011126 0.170459
polarizability: 2.18928026e+02 1.38398946e+01 2.23204567e+02 1.55669405e+01 -2.21303185e+00 1.87397234e+02
1716.lowfreq: -7.1799 -0.0011 -0.0006 0.0016 4.2220 6.1953 26.3188 32.4181 39.6765
frequency: 25.2088 32.3875 39.6669 47.5424 48.6191 72.8057 78.3285 98.1091 106.2364 135.6947 144.7787 169.2459 208.5022 212.6980 217.0513 242.4668 251.4718 307.4473 324.5172 338.7266 361.8662 404.9037 428.8850 459.6054 477.8805 501.1805 514.7992 534.0448 570.9820 591.1617 608.6338 642.1632 656.4860 706.9727 726.3315 743.9051 761.0826 772.2771 791.1724 805.8916 854.7000 867.1204 900.9140 930.4870 938.9094 940.9065 959.0692 978.6534 980.0680 985.9989 988.1698 1002.2029 1034.0293 1051.4948 1076.1026 1092.8511 1097.1350 1103.0358 1112.7838 1124.2719 1151.7245 1168.1110 1177.7011 1179.0334 1198.3483 1230.1488 1253.3981 1265.1266 1296.5954 1311.3202 1350.1835 1367.6486 1377.7468 1384.8167 1399.3448 1401.6629 1420.9048 1425.1223 1438.7104 1455.3238 1457.7765 1467.4229 1470.3829 1473.4365 1475.1309 1477.4587 1483.4230 1485.4972 1580.1688 1595.0724 1600.2769 1612.1523 2962.8935 2977.5718 2990.2518 3012.4244 3059.1795 3059.5422 3073.3126 3087.7715 3088.1451 3105.5475 3118.2646 3124.6511 3127.5419 3132.9608 3136.2903 3138.0791 3149.0801 3158.8361 3165.7850
redmass: 1.3807 4.5789 2.8342 2.6925 4.8651 2.8414 2.7755 4.5159 3.8221 2.0794 2.5085 2.2362 1.7333 2.0588 3.5708 3.3785 3.5493 5.2413 3.6491 2.5697 4.0441 3.9393 4.2796 3.1290 4.4808 5.1034 5.0208 4.2912 3.7744 4.3195 4.9020 7.8310 5.2476 2.1512 3.1176 3.4610 1.7657 2.3546 1.4715 1.6259 2.3762 1.8319 1.3163 2.2399 1.5650 1.4839 5.6522 1.3269 1.3457 3.3465 5.2908 1.6200 2.0689 1.5662 2.8146 1.6031 2.0388 2.2306 1.2666 1.6296 1.3591 1.0793 1.3552 1.6979 2.8629 2.5240 2.0985 1.6073 1.8191 1.3897 1.2801 9.4490 7.1765 1.2162 1.2363 2.6800 1.6158 2.6519 1.4741 1.1152 1.1360 1.0438 1.1475 1.0946 1.4482 1.9273 1.1363 1.6631 6.7301 5.9299 6.8070 6.2326 1.0311 1.0383 1.0353 1.0593 1.0958 1.1041 1.1026 1.1000 1.1000 1.1022 1.1017 1.0862 1.0848 1.0938 1.0895 1.0917 1.0949 1.0995 1.1009
irintensity: 0.4143 1.1578 0.4930 0.2588 0.4943 4.7107 4.7145 0.2432 2.1192 2.4769 1.1975 2.6532 1.4225 1.0897 1.6545 0.5436 3.5957 2.3655 7.5547 2.0206 1.4200 1.8458 0.4259 6.6172 9.7737 3.2039 1.1685 1.5053 4.5503 4.0718 3.0630 2.2138 3.5910 29.2597 1.8926 26.9859 38.7559 34.2251 44.9162 22.2923 2.0204 3.0222 1.0523 1.1159 9.0172 2.6027 48.1602 0.0303 0.2641 7.0770 1.9084 1.7373 11.4700 17.1644 7.9608 31.1588 38.5458 47.8164 2.8722 19.0696 0.0990 1.3853 3.2616 15.6377 73.3353 29.8945 3.0143 58.3892 39.2124 8.9696 2.9167 2.8631 2.6192 22.9633 15.9363 212.4800 14.7855 12.0427 7.3334 16.0443 40.2974 6.6087 9.9205 6.6958 27.7930 28.1616 29.2567 60.9891 10.8273 17.8959 3.4168 35.1063 76.0313 27.6292 27.6864 27.8744 12.4610 28.2842 1.9128 36.8452 15.3689 18.1774 24.8515 3.6427 0.3032 0.7001 6.2849 21.7768 21.1912 22.6824 23.5900
temp: 298.150 k
press: 1.00000 atm
elementType: 16 8 7 6 6 6 6 6 6 6 6 6 6 6 6 6 6 6 6 6 1 1 1 1 1 1 1 1 1 1 1 1 1 1 1 1 1 1 1
symmnumber: 1
zpe: 827097.7 jmol-1
zpe.correction: 0.315025 hartree
zpe.thermalcorrener: 0.335424 hartree
zpe.thermalcorrenthalpy: 0.336368 hartree
zpe.thermalcorrgfe: 0.263796 hartree
zpe.sumelectzpe: -1185.780827 hartree
zpe.sumelectthermal: -1185.760428 hartree
zpe.sumelectthermalent: -1185.759483 hartree
zpe.sumelectthermalfe: -1185.832055 hartree
dipole: -2.8147 -2.1120 0.5296
dipole: 3.5586
quadrupole: -121.5727 -120.2976 -116.3711
quadrupole: -8.8229 7.9206 -1.0134
quadrupole: -2.1589 -0.8838 3.0427 -8.8229 7.9206 -1.0134
hfenergy: -1186.0958517 hartree
pointgroup: C01 [X(C17H19N1O1S1)]
dipole: -1.0284161 -0.924841 0.2172426 debye
polarizability: 210.0475502|16.348938|225.6780076|16.7206168|-4.5087369|193.8042681 unknown
InChI: InChI=1S/C17H19NOS/c1-4-18(14-9-7-8-13(2)12-14)17(20)15-10-5-6-11-16(15)19-3/h5-12H,4H2,1-3H3
charge 0 multiplicity 1
39 atoms
S  2.01033 2.70712 -0.468508
O  1.513563 0.264669 2.039395
N  -0.456941 1.554986 -0.767328
C  -1.412401 0.471737 -0.586115
C  -1.027129 2.906109 -1.046836
C  0.88798 1.401059 -0.51524
C  1.411634 -0.000864 -0.374474
C  -1.524912 -0.164517 0.670715
C  -2.462927 -1.209448 0.867209
C  -2.247562 0.090051 -1.663184
C  -1.455035 3.629414 0.245644
C  1.826439 -0.498475 0.887282
C  -3.293986 -1.589506 -0.216861
C  -3.189362 -0.9420 -1.469991
C  1.585672 -0.820012 -1.518922
C  -2.58116 -1.883579 2.223073
C  2.435135 -1.767373 1.003811
C  2.195497 -2.088446 -1.410698
C  2.626625 -2.5610 -0.148705
C  2.670949 0.86849 2.732029
H  -0.245973 3.489461 -1.565013
H  -1.890309 2.770276 -1.72131
H  -0.871476 0.152026 1.492417
H  -2.143152 0.576061 -2.639485
H  -1.881024 4.61855 -0.002398
H  -2.219211 3.050353 0.794029
H  -0.581009 3.781611 0.900803
H  -4.023377 -2.396776 -0.080057
H  -3.832772 -1.252319 -2.300689
H  1.264395 -0.444359 -2.496631
H  -3.114477 -2.847143 2.150839
H  -1.586088 -2.071636 2.663898
H  -3.13871 -1.246795 2.936853
H  2.727411 -2.134107 1.994142
H  2.334981 -2.703909 -2.305809
H  3.096263 -3.546924 -0.060202
H  2.259469 1.352655 3.630846
H  3.146637 1.618807 2.073631
H  3.408311 0.096248 3.025639
