program: Gaussian 09
title: 000292055
version: EM64L-G09RevD.01
frameworkgroup: C1[X(C13H14BrN3O2S)]
method: RPBEPBE
basis: SDD
operation: Freq
keyword: #p
keyword: freq=noraman
keyword: PBEPBE/SDD
title: #p freq=noraman PBEPBE/SDD
converged: NO YES NO NO
title: Mulliken charges:
elementType: Br S O O N N N C C C C C C C C C C C C C H H H H H H H H H H H H H H
charge: 0.029220 0.787508 -0.630945 -0.653244 -0.260337 -0.255239 -0.700108 -0.147592 0.137472 0.373289 -0.405984 -0.279196 -0.292218 0.520298 -0.330452 -0.174305 -0.790153 -0.411462 -0.178441 -0.218653 0.298062 0.419003 0.256821 0.289076 0.290302 0.258431 0.230304 0.222954 0.263320 0.250541 0.221972 0.256580 0.310460 0.312713
chargesum: 0.00000
title: Mulliken charges with hydrogens summed into heavy atoms:
elementType: Br S O O N N N C C C C C C C C C C C C C
charge: 0.029220 0.787508 -0.630945 -0.234241 0.037725 -0.255239 -0.076935 -0.147592 0.137472 0.373289 -0.149163 0.009880 -0.001915 0.520298 -0.072021 0.055998 -0.053338 -0.189490 0.078140 -0.218653
polarizability: 2.95313371e+02 -1.69962635e+01 2.03768905e+02 -7.61707121e+00 2.89186661e+01 1.75489915e+02
1716.lowfreq: -10.2296 -7.0696 -4.0165 0.0015 0.0016 0.0017 7.7782 10.7978 16.0707
frequency: 5.4637 10.4087 15.9439 37.0098 72.4403 88.3688 115.9655 129.8056 151.1137 153.8995 183.6881 196.4756 207.2448 216.3952 223.1678 240.3519 268.2703 276.7868 297.9370 352.8607 360.2336 371.7828 382.5231 386.0033 395.6468 414.8865 455.3296 460.2221 520.5167 522.9112 548.6048 559.1874 573.1144 593.4666 655.0759 664.5989 685.9982 717.4122 785.4082 789.5446 806.6429 840.5205 849.8514 850.5806 854.9474 880.6790 886.3184 969.8757 973.5720 991.5228 1002.1286 1016.1001 1017.9745 1037.8204 1061.4651 1078.0243 1086.5104 1098.1347 1102.7873 1172.5733 1183.5914 1200.4023 1265.2399 1275.6333 1320.1775 1370.3272 1379.8866 1390.8633 1407.2212 1432.9457 1446.5679 1454.0688 1466.8969 1468.0705 1482.4707 1525.6703 1540.2681 1570.9752 1578.1591 1591.0683 1623.5281 1643.5998 1970.6618 2712.1530 2992.7362 3073.2056 3097.3357 3123.4155 3132.1922 3147.0010 3158.9602 3161.2176 3167.5897 3178.7610 3567.1766 3707.0541
redmass: 5.8667 4.5581 4.4324 8.1464 9.4930 7.4277 6.5316 9.0464 1.4369 3.6419 2.5110 6.6175 5.6087 3.8705 6.2049 7.5516 7.8859 8.0862 4.5205 9.1507 5.5383 1.1287 1.4041 2.6850 4.1277 3.3500 3.1189 3.4284 5.4738 6.2490 3.5894 5.3149 5.9267 11.6002 6.7520 6.8402 2.0450 3.4972 14.8132 1.4118 5.0953 1.3430 4.0875 6.3882 1.9254 1.3316 1.3908 4.6246 1.3930 1.3046 1.5463 1.4379 1.2284 1.5187 2.0556 2.0028 1.1329 1.3420 2.1303 1.0819 1.8326 3.1919 1.3205 1.4969 1.8931 6.2080 2.9180 6.0021 1.3078 6.0561 3.0802 2.3638 1.1962 1.0452 3.2075 1.0900 1.5981 6.5837 3.3449 6.5631 4.2578 1.2802 1.0927 1.0825 1.0375 1.0968 1.1003 1.0876 1.0914 1.0924 1.0883 1.0924 1.0968 1.0973 1.0450 1.1041
irintensity: 0.4771 0.1937 0.5773 0.6231 0.8773 0.3870 0.6775 2.0431 4.6923 2.4755 1.6651 9.0529 6.6045 1.5564 73.0693 5.9626 0.1184 0.9541 1.3659 2.2216 2.0950 77.5346 209.3080 66.7329 1.1929 2.8263 5.1594 36.8847 8.4119 0.1208 16.9630 1.8871 12.8073 53.3809 4.8335 13.1311 36.5921 1.8178 35.2030 52.9070 24.5291 21.8940 14.1050 75.1199 35.2625 6.8255 1.3690 10.4187 6.6930 7.8957 2.5255 57.8316 144.1309 2.1062 4.1161 32.5256 19.9761 21.1137 1.0419 3.9023 11.2727 117.3040 6.2711 12.5802 28.2017 12.2216 20.6174 22.2978 6.1212 33.8032 1.8397 23.7531 76.9960 13.0318 88.7132 8.0669 70.7912 27.3882 33.6017 127.1248 84.3495 241.7623 2570.8622 897.0434 7.4734 6.0329 22.0835 12.4110 7.1722 16.2141 0.8639 3.8797 15.7739 4.4285 69.4723 22.0958
temp: 298.150 k
press: 1.00000 atm
elementType: 35 16 8 8 7 7 7 6 6 6 6 6 6 6 6 6 6 6 6 6 1 1 1 1 1 1 1 1 1 1 1 1 1 1
symmnumber: 1
zpe: 648801.8 jmol-1
zpe.correction: 0.247116 hartree
zpe.thermalcorrener: 0.267998 hartree
zpe.thermalcorrenthalpy: 0.268942 hartree
zpe.thermalcorrgfe: 0.192203 hartree
zpe.sumelectzpe: -1228.432872 hartree
zpe.sumelectthermal: -1228.411989 hartree
zpe.sumelectthermalent: -1228.411045 hartree
zpe.sumelectthermalfe: -1228.487784 hartree
dipole: 0.8618 5.9154 0.2570
dipole: 5.9833
quadrupole: -130.7216 -127.4261 -127.9143
quadrupole: 23.9561 -1.1766 5.1370
quadrupole: -2.0343 1.2612 0.7731 23.9561 -1.1766 5.1370
hfenergy: -1228.6799873 hartree
pointgroup: C01 [X(C13H14Br1N3O2S1)]
dipole: 0.3021663 -0.8286598 2.1825388 debye
polarizability: 241.4548463|-50.5650865|227.2398606|-47.1963808|-1.0582477|205.877483 unknown
InChI: InChI=1S/C7H7BrN2.C6H7NO2S/c1-5-4-6(8)2-3-7(5)10-9;7-5-2-1-3-6(4-5)10(8)9/h2-4,9H,1H3;1-4,8H,7H2
charge 0 multiplicity 1
34 atoms
Br -4.835375 4.480204 2.145075
S  0.754431 -1.936662 -2.233831
O  1.216818 -0.555571 -3.05332
O  -0.795462 -1.565003 -1.389582
N  -0.105957 1.635026 -1.993317
N  -0.934078 1.025746 -1.210999
N  2.132889 -3.407637 2.665559
C  1.913584 -1.90299 -0.724941
C  -1.834489 1.841144 -0.433684
C  -2.756036 1.183883 0.437936
C  1.561102 -2.659812 0.403409
C  3.100291 -1.156412 -0.826085
C  -1.806273 3.257601 -0.539389
C  2.447641 -2.678071 1.520011
C  -3.638463 1.996702 1.194888
C  3.971143 -1.178933 0.290396
C  -2.823179 -0.323904 0.581493
C  3.659975 -1.927094 1.442059
C  -2.685463 4.049891 0.215289
C  -3.596364 3.399614 1.079354
H  0.487222 0.880242 -2.491891
H  -0.882435 -0.486566 -1.221408
H  0.606772 -3.198275 0.437953
H  3.310925 -0.571623 -1.726494
H  -1.082518 3.709511 -1.224525
H  -4.35585 1.523989 1.87204
H  4.905228 -0.60722 0.257622
H  -3.610807 -0.609734 1.297925
H  -3.036112 -0.821137 -0.381589
H  -1.864684 -0.74411 0.934995
H  4.352283 -1.931762 2.292863
H  -2.667911 5.140144 0.137237
H  2.759318 -3.417075 3.464878
H  1.278337 -3.953907 2.718774
