program: Gaussian 09
title: 000291984
version: EM64L-G09RevD.01
frameworkgroup: C1[X(C15H17NO3)]
method: RPBEPBE
basis: SDD
operation: Freq
keyword: #p
keyword: freq=noraman
keyword: PBEPBE/SDD
title: #p freq=noraman PBEPBE/SDD
converged: YES YES NO NO
title: Mulliken charges:
elementType: O O O N C C C C C C C C C C C C C C C H H H H H H H H H H H H H H H H H
charge: -0.225296 -0.241775 -0.258964 -0.618624 0.364102 -0.433793 -0.498589 -0.509768 -0.442489 -0.432075 -0.412947 0.526241 0.173504 0.220970 -0.455200 -0.385267 -0.224383 -0.248500 -0.244378 0.284340 0.227556 0.254114 0.235327 0.261140 0.226043 0.222804 0.224576 0.211543 0.319522 0.239422 0.251681 0.336321 0.364141 0.228497 0.229223 0.230979
chargesum: 0.00000
title: Mulliken charges with hydrogens summed into heavy atoms:
elementType: O O O N C C C C C C C C C C C C C C C
charge: -0.225296 -0.241775 -0.258964 0.081838 0.364102 -0.149453 -0.016919 -0.013300 0.006359 0.004044 -0.093425 0.526241 0.173504 0.220970 -0.215778 -0.133586 0.004114 -0.019277 -0.013398
polarizability: 1.93257030e+02 4.14636880e+00 1.46010894e+02 -1.85478589e+00 -9.78728898e+00 1.58778841e+02
1716.lowfreq: -5.7165 -5.5398 -0.0010 -0.0009 -0.0006 8.4075 28.8251 43.8967 45.2214
frequency: 28.7120 43.8704 44.5576 67.4133 71.0801 97.0018 101.7766 166.6261 207.5676 227.1646 246.2675 276.6249 280.9862 336.2057 353.0839 403.6117 417.8055 436.3987 462.6605 528.8691 536.1463 550.2799 575.1259 610.6515 617.2813 625.9150 639.2891 668.9136 682.6669 702.6369 707.0854 757.4758 793.3314 814.1849 829.9791 847.6493 855.2562 865.5996 890.5076 906.3416 912.3580 929.6445 950.8520 965.4424 978.1728 990.8024 997.1301 1018.8127 1030.4030 1047.2773 1056.5389 1070.9558 1084.3153 1091.6812 1126.6208 1142.8727 1161.1249 1173.3102 1188.2145 1193.6031 1206.9954 1210.6756 1226.7072 1231.9642 1251.9556 1271.5356 1294.2752 1302.5682 1308.3699 1313.0294 1320.6305 1331.4868 1354.7342 1386.9960 1445.0480 1447.2510 1464.4810 1471.7420 1481.7310 1485.0787 1591.0011 1596.2294 1613.8039 1650.2492 1657.1982 2994.9710 3001.6805 3003.3292 3011.3728 3027.5997 3037.0349 3063.9850 3071.5658 3082.5135 3089.2873 3119.6682 3121.7984 3135.5782 3146.5228 3164.3238 3456.2178 3637.1519
redmass: 3.9338 6.0581 2.8051 5.4313 4.6151 6.7350 4.1165 5.1061 3.3057 5.0971 3.5795 3.5578 2.6366 4.1362 3.8269 2.8077 5.3431 4.3717 3.3424 2.7200 2.1285 3.3300 2.8340 5.1667 5.4683 4.0859 2.3715 2.5419 1.1324 2.9279 1.6815 2.5757 3.6726 3.3031 2.2497 2.9403 1.2514 2.1967 3.8827 3.1371 2.5316 1.6921 1.7544 2.1135 1.4085 5.8054 1.3178 2.4430 2.0952 1.7371 2.0409 1.8397 1.6971 1.9961 3.3811 2.7734 1.7027 1.0573 2.0269 1.1444 2.0839 1.3417 1.3655 1.4081 1.4813 1.6264 1.3439 1.4171 1.3450 1.4767 3.4781 1.6547 1.5493 3.9064 1.6923 1.2290 1.0848 1.0840 1.1067 2.2533 3.9689 1.7513 5.9750 4.6559 5.8341 1.0636 1.0674 1.0602 1.0628 1.0833 1.0850 1.0983 1.1019 1.1021 1.1019 1.0864 1.0872 1.0912 1.0959 1.1015 1.0501 1.1006
irintensity: 0.0952 0.9220 0.0625 5.8359 1.5191 3.0331 0.9351 14.2923 3.0660 2.2977 1.5474 2.1489 3.6581 5.4044 3.4778 0.0049 0.5909 3.1521 5.0416 34.4480 1.8219 17.2071 5.9635 13.0099 2.7714 19.1202 104.2351 47.5575 118.0492 6.8203 59.8017 35.3548 20.3062 7.6179 7.0544 1.3722 0.0405 14.8168 28.7330 28.8634 5.6451 1.7013 12.7971 5.1673 0.1504 0.3768 0.0466 2.9612 4.7647 0.7961 28.9256 4.1909 41.5775 24.6471 191.8013 26.7893 5.4684 0.0962 15.3529 0.6436 20.4017 11.3394 2.2912 6.1229 3.2069 4.1823 2.5210 2.0431 4.0181 2.4733 146.1704 23.4828 0.4413 0.4103 9.6216 9.0350 9.2992 9.9555 7.7936 19.4372 33.0212 174.8813 4.7082 303.6319 248.5826 36.9751 13.7058 39.4334 10.4144 2.4708 3.8200 30.8957 22.1988 18.9920 30.8964 6.2975 2.3052 11.0466 32.4915 23.3459 51.4006 65.1961
temp: 298.150 k
press: 1.00000 atm
elementType: 8 8 8 7 6 6 6 6 6 6 6 6 6 6 6 6 6 6 6 1 1 1 1 1 1 1 1 1 1 1 1 1 1 1 1 1
symmnumber: 1
zpe: 768391.8 jmol-1
zpe.correction: 0.292665 hartree
zpe.thermalcorrener: 0.309349 hartree
zpe.thermalcorrenthalpy: 0.310294 hartree
zpe.thermalcorrgfe: 0.246989 hartree
zpe.sumelectzpe: -860.861422 hartree
zpe.sumelectthermal: -860.844737 hartree
zpe.sumelectthermalent: -860.843793 hartree
zpe.sumelectthermalfe: -860.907097 hartree
dipole: 1.4627 0.5152 -0.8801
dipole: 1.7831
quadrupole: -100.6007 -105.0823 -123.3501
quadrupole: 2.5045 2.2381 -2.7686
quadrupole: 9.0770 4.5954 -13.6724 2.5045 2.2381 -2.7686
hfenergy: -861.1540866 hartree
pointgroup: C01 [X(C15H17N1O3)]
dipole: 0.5172128 0.4164925 -0.2262485 debye
polarizability: 182.5425304|20.1247782|156.064286|7.7682557|-6.3792429|159.4399492 unknown
InChI: InChI=1S/C15H17NO3/c16-13(17)11-12(10-6-2-1-3-7-10)15(19-14(11)18)8-4-5-9-15/h1-3,6-7,11-12H,4-5,8-9,16H2
charge 0 multiplicity 1
36 atoms
O  -1.414226 0.089578 1.36373
O  -1.59289 -2.142349 1.97928
O  -0.764344 -1.913091 -2.321534
N  -1.525729 -3.389892 -0.68636
C  -0.859023 0.868018 0.1586
C  0.300343 -0.056104 -0.366284
C  -0.479947 2.278159 0.65786
C  -2.043834 1.072735 -0.845024
C  -1.731932 3.147184 0.399403
C  -2.24137 2.610352 -0.962527
C  -0.16763 -1.473306 0.043235
C  1.686855 0.284473 0.175491
C  -1.120478 -1.259067 1.228825
C  -0.857695 -2.265789 -1.110354
C  2.706284 0.693911 -0.720446
C  1.997429 0.196773 1.55925
C  4.003024 1.008124 -0.253201
C  3.291303 0.509037 2.029525
C  4.300155 0.916829 1.125256
H  0.323471 0.003133 -1.468536
H  0.370194 2.648158 0.053161
H  -0.150096 2.258434 1.709305
H  -2.948904 0.610782 -0.410241
H  -1.851154 0.582003 -1.814125
H  -1.503715 4.22718 0.383569
H  -2.489114 2.968727 1.186157
H  -3.29025 2.88247 -1.17285
H  -1.618856 3.018611 -1.782084
H  0.673335 -2.101681 0.38991
H  2.484151 0.756397 -1.792947
H  1.226928 -0.107844 2.278005
H  -1.980492 -3.984119 -1.378773
H  -1.646593 -3.574239 0.314756
H  4.778337 1.318764 -0.96252
H  3.512389 0.43656 3.10038
H  5.304378 1.157892 1.491108
