program: Gaussian 09
title: 000292056
version: EM64L-G09RevD.01
frameworkgroup: C1[X(C13H13N3O5S)]
method: RPBEPBE
basis: SDD
operation: Freq
keyword: #p
keyword: freq=noraman
keyword: PBEPBE/SDD
title: #p freq=noraman PBEPBE/SDD
converged: YES YES NO NO
title: Mulliken charges:
elementType: S O O O O O N N N C C C C C C C C C C C C C H H H H H H H H H H H H H
charge: 0.772960 -0.627698 -0.577354 -0.242722 -0.199119 -0.228099 -0.194560 -0.246209 0.022656 -0.135716 -0.302380 0.174995 -0.234689 0.398390 0.255874 -0.174840 -0.358026 -0.305904 -0.313246 -0.240304 -0.217143 -0.562218 0.219718 0.305260 0.300307 0.440473 0.247095 0.287122 0.239137 0.257672 0.241989 0.238252 0.231468 0.225809 0.301048
chargesum: 0.00000
title: Mulliken charges with hydrogens summed into heavy atoms:
elementType: S O O O O O N N N C C C C C C C C C C C C C
charge: 0.772960 -0.187225 -0.577354 -0.242722 -0.199119 -0.228099 0.025159 -0.246209 0.022656 -0.135716 0.002880 0.174995 0.065618 0.398390 0.255874 0.072256 -0.070904 -0.066767 -0.055574 0.001686 0.021109 0.196107
polarizability: 2.94152032e+02 5.40999385e-01 2.67891208e+02 3.10957659e+00 -9.12043323e+00 9.92993588e+01
1716.lowfreq: -3.6534 0.0018 0.0020 0.0023 3.7433 6.5603 16.8354 21.6788 32.7023
frequency: 16.7953 21.5962 32.6938 39.3378 54.4621 60.4767 70.4624 90.2762 114.6949 122.8033 134.7477 150.0580 174.7029 195.7610 216.7075 222.7358 235.4648 254.2872 268.6075 299.3568 306.4553 329.3422 391.9401 394.4716 407.1170 423.7314 450.1982 471.7843 512.7285 522.0833 526.7164 567.3900 572.8566 634.3829 637.3404 668.9045 686.2834 701.1594 712.7259 752.6782 762.7852 803.5302 806.1114 818.4309 847.3380 852.4377 904.3695 912.9545 933.9921 957.9382 962.9570 967.6116 980.1820 982.6656 1003.8809 1041.1685 1056.8417 1081.4023 1099.8430 1100.5492 1112.8393 1149.8470 1166.5354 1176.0268 1179.7147 1216.5249 1240.7400 1268.2449 1274.3479 1354.1133 1364.1016 1386.9623 1396.9452 1406.5685 1419.6189 1427.3626 1440.8970 1447.3201 1467.6037 1471.1613 1477.4783 1485.2692 1582.1641 1586.3252 1595.7395 1597.7725 2642.3078 2971.4922 2977.3905 3075.6354 3124.7406 3138.2101 3144.0684 3144.9679 3160.8349 3167.4853 3179.3789 3186.1228 3187.9149
redmass: 5.8997 5.6290 7.8036 8.2200 7.0094 8.8695 8.9468 7.9249 3.5254 4.1772 8.0472 5.5362 5.2713 5.5499 2.2994 8.2377 6.7738 1.9163 2.8672 3.5214 11.3404 6.4037 6.2415 5.7079 6.0734 3.9719 2.8898 7.3247 6.6241 6.6794 3.4872 7.8077 8.0849 4.4190 7.2087 3.0603 9.3733 4.3631 3.5247 1.6860 2.4190 5.8175 9.6542 1.4011 1.4433 17.2767 1.5608 1.5300 1.4136 1.3420 1.2085 5.4266 1.3487 5.3965 1.3610 2.1854 1.9774 1.6774 3.1535 2.9406 1.2524 1.4683 1.1242 1.5113 1.2033 8.9302 3.0954 1.3169 1.6213 1.3564 9.1519 5.8517 1.3201 8.8267 2.8709 1.8772 1.3513 2.3696 2.2770 1.3911 1.9531 1.0746 7.2286 6.8873 7.5585 5.9126 1.0784 1.0704 1.0322 1.1048 1.0884 1.0894 1.0937 1.0961 1.0927 1.0941 1.0983 1.0944 1.0940
irintensity: 3.0830 0.1833 2.6758 2.7431 1.4757 1.4005 0.3594 2.5759 6.8003 1.3560 8.9633 15.9405 4.6769 3.6314 1.1712 7.0845 8.7877 3.3674 8.1575 5.5645 15.3124 13.6876 10.2056 2.4404 10.6348 6.4108 6.5170 1.1142 6.6298 5.9362 5.9975 40.6345 43.4948 3.0785 5.2092 15.7544 7.0310 30.8164 7.8298 76.4608 42.0843 0.6831 13.9814 42.0315 2.2426 69.0928 2.0816 24.2691 3.0219 9.8385 121.4121 30.8104 0.5435 1.0857 2.9016 6.3917 11.3346 28.8419 11.8062 8.7837 0.1804 21.0904 16.2973 36.5637 0.1467 251.7392 149.1003 2.6902 54.6635 135.3805 126.8818 66.9297 13.7532 1.5589 62.9763 44.8386 4.0972 34.9776 55.6430 35.6402 63.4268 16.6277 16.2529 7.0299 6.6191 64.9396 3569.9847 33.5463 40.2843 32.2297 1.2920 4.7156 2.3050 5.3537 11.1384 15.3219 9.1608 1.8163 12.9822
temp: 298.150 k
press: 1.00000 atm
elementType: 16 8 8 8 8 8 7 7 7 6 6 6 6 6 6 6 6 6 6 6 6 6 1 1 1 1 1 1 1 1 1 1 1 1 1
symmnumber: 1
zpe: 646677.8 jmol-1
zpe.correction: 0.246307 hartree
zpe.thermalcorrener: 0.268254 hartree
zpe.thermalcorrenthalpy: 0.269198 hartree
zpe.thermalcorrgfe: 0.191780 hartree
zpe.sumelectzpe: -1439.767099 hartree
zpe.sumelectthermal: -1439.745152 hartree
zpe.sumelectthermalent: -1439.744207 hartree
zpe.sumelectthermalfe: -1439.821625 hartree
dipole: 5.7312 2.8874 1.0510
dipole: 6.5029
quadrupole: -88.2464 -154.2725 -138.1725
quadrupole: 12.4978 1.1248 -9.3757
quadrupole: 38.6507 -27.3754 -11.2753 12.4978 1.1248 -9.3757
hfenergy: -1440.0134051 hartree
pointgroup: C01 [X(C13H13N3O5S1)]
dipole: 2.5044259 0.2040204 0.4815598 debye
polarizability: 288.7280726|-5.8942746|228.6518126|10.5340185|-76.4052959|143.9627133 unknown
InChI: InChI=1S/C7H8N2O.C6H5NO4S/c1-10-7-5-3-2-4-6(7)9-8;8-7(9)5-2-1-3-6(4-5)12(10)11/h2-5,8H,1H3;1-4,10H
charge 0 multiplicity 1
35 atoms
S  -2.304385 -1.328362 1.133313
O  -0.780422 -1.33157 0.109651
O  -3.296934 -2.584228 0.758658
O  1.873971 0.396646 0.321525
O  -2.603645 4.347257 -2.017328
O  -0.798574 3.427906 -0.97663
N  0.966811 -2.546374 2.742275
N  1.30799 -1.877414 1.692191
N  -2.037791 3.399223 -1.351482
C  -3.041427 0.077951 0.088354
C  -2.259402 1.203313 -0.201567
C  2.673704 -1.622306 1.32215
C  -4.356668 -0.075113 -0.383031
C  -2.848138 2.209802 -0.996396
C  2.942311 -0.454664 0.534444
C  -4.922255 0.956918 -1.171501
C  -4.173379 2.1108 -1.481295
C  3.72233 -2.52848 1.629607
C  4.26338 -0.2236 0.071477
C  5.029291 -2.289514 1.167661
C  5.29164 -1.134273 0.390616
C  2.062721 1.552138 -0.577983
H  1.80654 -2.824542 3.341278
H  -1.22314 1.284154 0.134482
H  -4.894766 -1.004124 -0.159021
H  0.032843 -1.532405 0.737945
H  -5.943954 0.855328 -1.550481
H  -4.584015 2.918777 -2.092361
H  3.498557 -3.450606 2.180559
H  4.490604 0.661344 -0.528731
H  5.829302 -3.004134 1.382183
H  6.305395 -0.94663 0.020812
H  2.384058 1.216504 -1.581004
H  2.799873 2.259175 -0.153702
H  1.077573 2.033603 -0.640163
