program: Gaussian 09
title: 000292057
version: EM64L-G09RevD.01
frameworkgroup: C1[X(C13H12BrN3O4S)]
method: RPBEPBE
basis: SDD
operation: Freq
keyword: #p
keyword: freq=noraman
keyword: PBEPBE/SDD
title: #p freq=noraman PBEPBE/SDD
converged: YES YES NO NO
title: Mulliken charges:
elementType: Br S O O O O N N N C C C C C C C C C C C C C H H H H H H H H H H H H
charge: 0.039440 0.857821 -0.574379 -0.525724 -0.200821 -0.188432 -0.269087 -0.404060 0.023653 -0.121643 0.626794 -0.362786 -0.208315 0.400455 0.455053 -0.431833 -0.372124 -0.184804 -0.358605 -0.387683 -0.353813 -0.795702 0.287653 0.336622 0.344463 0.294241 0.304171 0.250356 0.259867 0.251540 0.293531 0.231226 0.247430 0.235495
chargesum: 0.00000
title: Mulliken charges with hydrogens summed into heavy atoms:
elementType: Br S O O O O N N N C C C C C C C C C C C C C
charge: 0.039440 0.857821 -0.574379 -0.525724 -0.200821 -0.188432 0.018566 -0.059597 0.023653 -0.121643 0.626794 -0.026165 0.085926 0.400455 0.455053 -0.431833 -0.067953 0.065552 -0.098738 -0.136142 -0.060283 -0.081551
polarizability: 3.49231454e+02 -5.70428720e+00 2.39485669e+02 4.50101748e+01 -4.39779720e+00 1.85071256e+02
1716.lowfreq: -5.5710 -2.9414 -0.0010 -0.0006 0.0010 4.4519 7.2341 12.4456 20.8050
frequency: 6.6491 12.4012 20.6962 40.8870 46.8541 57.9867 64.0421 77.4299 104.1990 110.1701 121.1810 138.3411 163.3433 179.8933 187.3433 205.8491 227.9722 233.1998 279.2887 310.5626 323.3083 345.9009 364.5551 378.0613 394.6777 420.5249 429.6104 440.4944 458.5660 513.0790 519.3787 545.2372 585.5710 633.9788 657.1013 669.6417 676.6304 684.8422 702.5854 714.2129 748.1789 767.3111 799.9272 819.6791 835.1084 850.6433 874.8715 883.5593 924.7531 939.4301 960.2690 971.9129 980.4495 998.6414 1006.5719 1020.2850 1046.0597 1048.8574 1080.9159 1095.4424 1153.6562 1167.1431 1174.3358 1213.3207 1215.0865 1262.0852 1266.0683 1296.4196 1341.1516 1374.1389 1390.9627 1400.7895 1401.4124 1403.8079 1419.4505 1444.8672 1467.6793 1473.4573 1480.9106 1512.6564 1567.8904 1582.7428 1596.9584 1605.8603 2980.8963 3063.1585 3090.0144 3094.5868 3145.6379 3148.2642 3157.6550 3163.3254 3167.3681 3186.7042 3255.1748 3476.5874
redmass: 8.7484 9.8986 6.6423 1.0301 11.0222 7.8489 6.0441 10.9447 9.4352 8.4185 6.2355 6.4016 4.4379 5.4634 6.1081 9.7504 5.9289 8.7387 5.3816 6.4893 7.3010 4.2287 7.7485 4.7534 8.8399 4.0124 4.1131 3.9658 5.0196 7.2024 6.4786 2.9971 3.2952 7.1650 7.1576 3.0341 2.1051 5.3046 3.6148 3.4998 4.1487 12.8672 9.9601 1.4421 1.6370 3.3680 3.7936 1.4358 1.3752 1.4096 1.3929 1.3624 5.8140 1.4501 1.3658 3.1205 1.5548 2.0420 1.7797 2.6914 2.6575 1.1300 1.6000 5.1787 2.2018 2.5713 1.3156 1.5996 2.9800 8.2789 2.5759 8.6365 1.4355 2.3109 3.0827 2.3825 1.1326 1.0692 2.2705 1.3799 3.5109 6.8598 7.6485 6.3054 1.0393 1.0945 1.0937 1.1000 1.0887 1.0938 1.0929 1.0937 1.0927 1.0966 1.0756 1.0776
irintensity: 0.2199 0.3479 1.8027 0.5692 0.4285 1.2636 0.1848 4.7977 8.1669 3.7300 1.6926 10.4562 0.6681 3.0088 29.1978 0.2819 14.0934 14.7115 21.9709 21.1519 5.3236 15.9018 3.9855 5.8065 0.4687 9.8078 4.3710 3.0097 46.3423 0.5170 41.0420 15.5094 9.5931 6.4931 7.0852 31.1097 6.7079 18.4706 21.3374 21.0742 17.5414 89.6047 24.3054 31.7367 44.6054 22.4843 21.8983 2.0063 108.1865 9.5594 5.1868 5.1605 2.6278 13.4253 1.0846 17.3501 29.3757 25.8188 26.4507 18.0529 88.1371 29.4436 32.4623 237.0596 55.5281 42.6121 0.2745 30.6455 126.3645 76.9290 75.6261 2.6929 7.0962 22.4165 46.6916 19.5581 22.8915 18.2025 58.7560 37.9873 20.5249 1.7101 3.8499 21.1843 24.5449 15.0177 3.4445 14.5525 2.7704 8.1189 6.3185 6.3807 16.8667 2.2219 20.7712 103.1048
temp: 298.150 k
press: 1.00000 atm
elementType: 35 16 8 8 8 8 7 7 7 6 6 6 6 6 6 6 6 6 6 6 6 6 1 1 1 1 1 1 1 1 1 1 1 1
symmnumber: 1
zpe: 615127.8 jmol-1
zpe.correction: 0.234290 hartree
zpe.thermalcorrener: 0.256734 hartree
zpe.thermalcorrenthalpy: 0.257678 hartree
zpe.thermalcorrgfe: 0.176609 hartree
zpe.sumelectzpe: -1377.392391 hartree
zpe.sumelectthermal: -1377.369947 hartree
zpe.sumelectthermalent: -1377.369003 hartree
zpe.sumelectthermalfe: -1377.450072 hartree
dipole: 10.0016 -2.9176 3.7209
dipole: 11.0629
quadrupole: -158.3234 -165.4922 -140.0523
quadrupole: 5.3201 -1.4619 2.6220
quadrupole: -3.7008 -10.8696 14.5704 5.3201 -1.4619 2.6220
hfenergy: -1377.626681 hartree
pointgroup: C01 [X(C13H12Br1N3O4S1)]
dipole: 4.1475963 0.2306888 1.299393 debye
polarizability: 334.2321669|24.6181014|210.4764163|44.7905796|44.7741254|229.0797955 unknown
InChI: InChI=1S/C7H8BrN2.C6H4NO4S/c1-5-2-3-7(10-9)6(8)4-5;8-7(9)5-2-1-3-6(4-5)12(10)11/h2-4,9-10H,1H3;1-4H
charge 0 multiplicity 1
34 atoms
Br 3.227465 0.369226 -2.054471
S  -2.312458 1.195221 0.39687
O  -1.867508 1.42748 1.981067
O  -3.872364 1.412894 -0.067929
O  -2.795194 -4.615501 -2.456351
O  -3.864962 -2.684398 -3.032715
N  -0.635444 2.22515 -0.938564
N  0.521793 1.525255 -0.919374
N  -3.05005 -3.360166 -2.298194
C  -1.939333 -0.646553 0.055759
C  1.538279 1.503673 0.07496
C  -2.625649 -1.275105 -0.992721
C  -1.025599 -1.312976 0.890993
C  -2.349595 -2.644524 -1.195188
C  3.635815 1.528306 2.023097
C  2.843614 1.040585 -0.245428
C  1.283119 1.94471 1.40296
C  -0.778421 -2.687342 0.659607
C  3.875279 1.049756 0.707528
C  2.323088 1.961426 2.349158
C  -1.437019 -3.361671 -0.389645
C  4.756121 1.579538 3.043461
H  -0.577522 2.983743 -0.216503
H  -3.360578 -0.746104 -1.607668
H  0.654664 0.92453 -1.741453
H  -0.554096 -0.773123 1.719797
H  0.25877 2.197285 1.710587
H  -0.077537 -3.230175 1.301192
H  4.8713 0.692525 0.428172
H  2.103077 2.295155 3.369089
H  -1.267936 -4.422828 -0.590499
H  5.563917 0.867951 2.802409
H  5.20632 2.590459 3.081989
H  4.386646 1.349795 4.058109
