program: Gaussian 09
title: 000291991
version: EM64L-G09RevD.01
frameworkgroup: C1[X(C17H15ClN2O3)]
method: RPBEPBE
basis: SDD
operation: Freq
keyword: #p
keyword: freq=noraman
keyword: PBEPBE/SDD
title: #p freq=noraman PBEPBE/SDD
converged: YES YES NO NO
title: Mulliken charges:
elementType: Cl O O O N N C C C C C C C C C C C C C C C C C H H H H H H H H H H H H H H H
charge: -0.042967 -0.244944 -0.209323 -0.205081 -0.147974 0.026571 0.424365 0.620305 -0.339935 -0.378465 -0.369168 -0.401273 -0.265279 -0.642012 -0.645336 0.317497 -0.312889 0.091648 -0.320982 -0.336765 0.377795 -0.381574 -0.369077 0.270754 0.245125 0.226747 0.291435 0.225289 0.242127 0.242001 0.244676 0.225177 0.244500 0.201914 0.230835 0.292158 0.284705 0.287419
chargesum: 0.00000
title: Mulliken charges with hydrogens summed into heavy atoms:
elementType: Cl O O O N N C C C C C C C C C C C C C C C C C
charge: -0.042967 -0.244944 -0.209323 -0.205081 -0.147974 0.026571 0.424365 0.620305 -0.069181 -0.133340 -0.369168 -0.174526 0.026156 0.067406 0.069017 0.317497 -0.110975 0.091648 -0.090147 -0.044607 0.377795 -0.096869 -0.081658
polarizability: 5.95359076e+02 3.97010499e+01 2.51884137e+02 3.18624367e+00 5.28846330e+00 9.40707299e+01
1716.lowfreq: -3.6962 0.0008 0.0018 0.0019 3.3276 4.4312 9.1293 18.8512 33.9991
frequency: 9.0875 18.8040 33.9808 46.0280 63.0727 64.9051 74.9776 106.8178 120.3650 131.4807 145.3520 148.2731 168.9129 186.2444 207.1969 217.9206 257.4914 263.5118 287.6628 299.6354 330.7713 374.3999 398.1087 407.4461 409.6540 448.1655 459.6118 481.0375 490.8066 518.2487 528.6010 563.1456 593.7452 624.5419 652.3103 665.0931 670.5213 679.7573 725.2165 731.8065 765.8693 786.8336 809.3429 820.2543 846.0694 846.6067 864.0820 883.4631 890.8865 952.3774 955.2759 985.8429 1002.5294 1013.3856 1015.7077 1016.2003 1042.9664 1055.3112 1092.2545 1103.4716 1108.8822 1112.8534 1148.3207 1171.8283 1180.0738 1210.4629 1220.6205 1237.3087 1253.3305 1283.8663 1296.7615 1310.8844 1336.6715 1362.3503 1365.8416 1380.7823 1400.6945 1410.2166 1431.1156 1450.5225 1456.0759 1466.3996 1474.0045 1479.9861 1490.1742 1498.7545 1510.5438 1520.3044 1532.1037 1591.2273 1604.7627 1614.8776 1632.5239 2954.9494 2961.1193 3026.1302 3028.8194 3108.4607 3117.9098 3119.5849 3141.6534 3146.8624 3161.9776 3162.8490 3176.5306 3183.8973 3186.7721 3189.1595
redmass: 5.4583 6.7161 6.6816 4.7079 3.7670 4.5384 7.3927 6.8972 2.1038 2.9220 5.1714 1.7120 2.4915 5.0262 1.6757 8.3444 5.5064 2.8059 7.3609 5.7759 5.8078 3.7824 7.1239 2.8655 4.7146 2.9817 3.7556 5.0130 8.5509 5.4364 3.7014 4.4872 3.9731 7.1285 5.0851 6.7317 7.9202 3.3581 2.9992 6.8145 3.6232 8.5861 1.5249 7.0519 1.5028 1.5048 1.7521 4.5575 1.7587 1.3732 3.0228 1.3768 3.2544 2.2969 1.5219 1.3174 3.3323 1.5366 3.1391 1.2360 1.3308 1.3313 1.5915 1.6944 1.3527 3.1217 4.6923 1.3360 2.8391 1.4724 1.3912 1.7487 1.8909 6.4521 3.2538 3.5985 9.8948 4.1261 1.2668 3.0591 1.2605 1.0400 2.3856 1.0453 1.1567 1.4104 7.2247 2.7141 3.3472 7.5700 6.2576 5.5375 6.5433 1.0368 1.0391 1.0998 1.1031 1.0968 1.0949 1.0895 1.0889 1.0881 1.0884 1.0888 1.0944 1.0952 1.0964 1.0913
irintensity: 0.1327 0.0019 0.4561 0.1487 0.0422 0.3290 6.3482 1.2759 4.3294 0.5801 0.7217 0.2341 1.8141 0.7723 0.2297 3.8020 0.8572 0.9281 4.0022 0.2091 7.6845 3.8600 15.3431 0.0661 2.6110 3.6605 10.7667 1.2643 9.6753 0.7030 15.6079 13.4668 4.0863 2.1184 3.4299 9.1812 4.3232 25.6389 10.2126 71.5154 0.1369 24.2332 43.3710 13.1423 6.5495 29.9164 54.3198 16.2543 17.8965 0.7361 37.5293 5.3570 27.9890 35.4617 24.1903 13.6767 107.8118 26.8388 18.8182 0.0119 28.5482 0.8523 36.7023 38.6545 48.5111 610.5517 214.8318 9.6503 24.5173 29.4178 203.5178 166.3303 30.9456 129.0404 171.2132 26.1476 3.0795 18.5544 8.2871 15.5309 115.7030 0.2035 11.1005 26.0800 5.9482 67.2726 839.7750 194.6114 96.8020 157.0846 5.6625 878.5962 223.1337 76.1659 166.6912 0.6574 66.7304 3.4698 41.8475 1.3013 2.4039 6.5628 10.3034 3.9044 14.2348 0.8999 1.5105 3.7783
temp: 298.150 k
press: 1.00000 atm
elementType: 17 8 8 8 7 7 6 6 6 6 6 6 6 6 6 6 6 6 6 6 6 6 6 1 1 1 1 1 1 1 1 1 1 1 1 1 1 1
symmnumber: 1
zpe: 745065.6 jmol-1
zpe.correction: 0.283781 hartree
zpe.thermalcorrener: 0.305579 hartree
zpe.thermalcorrenthalpy: 0.306523 hartree
zpe.thermalcorrgfe: 0.228878 hartree
zpe.sumelectzpe: -1450.310781 hartree
zpe.sumelectthermal: -1450.288982 hartree
zpe.sumelectthermalent: -1450.288038 hartree
zpe.sumelectthermalfe: -1450.365683 hartree
dipole: -12.3326 -4.9896 0.1476
dipole: 13.3046
quadrupole: -139.0188 -141.5748 -144.6181
quadrupole: 29.5585 0.0902 0.2093
quadrupole: 2.7184 0.1624 -2.8809 29.5585 0.0902 0.2093
hfenergy: -1450.5945611 hartree
pointgroup: C01 [X(C17H15Cl1N2O3)]
dipole: -4.9409891 -1.5298886 0.8032641 debye
polarizability: 595.9347378|38.7644668|200.9342352|16.6474526|-70.8490139|144.4449695 unknown
InChI: InChI=1S/C17H15ClN2O3/c1-19(2)15-9-3-12(16(18)11-15)6-10-17(21)13-4-7-14(8-5-13)20(22)23/h3-11H,1-2H3
charge 0 multiplicity 1
38 atoms
Cl -3.48252 2.423507 -2.189259
O  1.399294 2.225998 -1.402412
O  6.598575 -1.911847 1.755961
O  7.569439 -0.017498 0.93624
N  -6.345012 -1.053965 0.401834
N  6.541674 -0.766865 1.159426
C  -5.073866 -0.566036 0.126658
C  -2.409724 0.46247 -0.453934
C  -4.883532 0.53651 -0.768344
C  -3.901537 -1.14303 0.725236
C  -3.595647 1.012052 -1.030333
C  -2.633069 -0.63821 0.435971
C  -1.086785 0.985293 -0.749022
C  -6.5191 -2.187588 1.324538
C  -7.525528 -0.441183 -0.22843
C  2.694994 0.629197 -0.153447
C  0.120627 0.523512 -0.270507
C  1.378366 1.186259 -0.658164
C  2.822659 -0.626637 0.501307
C  3.8619 1.411797 -0.37358
C  5.214512 -0.28347 0.703821
C  4.079889 -1.091828 0.931132
C  5.12462 0.967878 0.052799
H  -5.732523 1.018609 -1.255567
H  -3.991693 -1.984718 1.416141
H  -1.766067 -1.104436 0.91559
H  -1.030677 1.846358 -1.42848
H  -7.590396 -2.422703 1.414888
H  -6.135191 -1.952807 2.336798
H  -6.00058 -3.09579 0.958975
H  -7.62747 0.626783 0.048242
H  -8.432932 -0.966293 0.1061
H  -7.47966 -0.509693 -1.33323
H  0.166614 -0.327972 0.415393
H  1.947788 -1.261473 0.666533
H  3.740113 2.368187 -0.89135
H  4.200016 -2.056312 1.431035
H  6.030328 1.558946 -0.10496
