program: Gaussian 09
title: 000291971
version: EM64L-G09RevD.01
frameworkgroup: C1[X(C14H17NO)]
method: RPBEPBE
basis: SDD
operation: Freq
keyword: #p
keyword: freq=noraman
keyword: PBEPBE/SDD
title: #p freq=noraman PBEPBE/SDD
converged: YES YES NO NO
title: Mulliken charges:
elementType: O N C C C C C C C C C C C C C C H H H H H H H H H H H H H H H H H
charge: -0.218014 -0.019888 -0.150932 -0.399736 -0.434659 -0.353136 0.080267 -0.432372 0.303021 -0.696098 -0.358090 -0.353176 -0.157111 -0.246492 -0.224806 -0.224187 0.200679 0.200928 0.224912 0.253121 0.226572 0.219819 0.185306 0.240224 0.270480 0.219401 0.217287 0.209071 0.229080 0.281913 0.233156 0.236741 0.236720
chargesum: 0.00000
title: Mulliken charges with hydrogens summed into heavy atoms:
elementType: O N C C C C C C C C C C C C C C
charge: -0.218014 -0.019888 0.049746 0.026105 0.045035 0.051989 0.080267 0.078332 0.303021 -0.050340 -0.129010 -0.071264 -0.157111 -0.013336 0.011935 0.012533
polarizability: 1.93644278e+02 1.82715070e+01 1.38923575e+02 1.12708448e+01 -5.85297270e+00 1.34089809e+02
1716.lowfreq: -9.5809 -0.0007 -0.0007 0.0002 5.8179 10.4310 22.0887 28.4406 48.8133
frequency: 20.3031 27.9667 48.8000 68.7650 71.5734 74.4642 91.3208 148.7490 156.4301 180.5918 197.2510 227.6210 254.9931 293.1646 310.9184 373.8145 383.6334 398.4020 417.0096 460.0703 476.0835 548.8527 612.8047 635.2423 690.8283 704.7966 708.4481 739.9860 785.6204 805.6123 856.9494 877.9801 884.6004 926.7644 944.5335 952.7076 989.0400 991.6127 998.6560 1012.4308 1018.6627 1023.7740 1027.7108 1065.2407 1073.7533 1088.4616 1102.9873 1121.0607 1173.3507 1177.6434 1187.7469 1214.5478 1231.9224 1250.3482 1278.6787 1286.3841 1295.8131 1304.5815 1309.5309 1339.2267 1350.3631 1367.1678 1386.5776 1390.0349 1434.1655 1446.2223 1456.0845 1463.6002 1470.2731 1476.2820 1476.9468 1484.7329 1555.4292 1591.6500 1608.2751 2197.8043 2965.5965 2973.3035 2974.8601 2987.1199 3003.6085 3009.5418 3014.3124 3041.0771 3043.5476 3071.5561 3075.7940 3081.7369 3130.5237 3140.3757 3152.1672 3160.8112 3170.9048
redmass: 6.2053 3.8122 4.8269 1.9315 3.2226 2.4093 4.0913 4.8173 5.1731 3.3660 2.9100 1.1540 3.0042 3.9344 5.1463 3.9547 4.3161 2.8097 3.9104 5.7675 3.2778 5.3802 6.3739 3.2291 2.6268 1.6172 2.5438 1.2358 1.4669 2.3037 1.2523 1.5360 1.9085 4.1426 1.5436 3.9087 5.1633 1.4440 1.7757 1.3590 2.8046 2.6498 2.1765 2.1583 2.6076 1.7397 1.9134 2.2319 1.0968 1.1957 1.1374 1.6361 2.2105 1.2154 1.2152 1.1313 1.3142 1.2081 1.3603 1.4545 1.4243 1.4890 8.9366 1.2128 2.2418 1.0806 1.0870 1.1001 1.0797 2.0727 1.0585 1.0752 6.9569 6.3337 6.2481 12.4350 1.0599 1.0570 1.0402 1.0590 1.0842 1.0617 1.0960 1.1006 1.1018 1.1008 1.0995 1.1039 1.0852 1.0881 1.0922 1.0957 1.1011
irintensity: 0.8797 0.0899 2.9856 1.7256 1.3256 2.9863 3.9372 0.7033 4.7273 1.0753 0.7103 0.0751 0.2824 1.9167 7.6931 0.4873 2.0704 0.1583 0.4762 2.6233 2.5751 14.3526 0.3872 3.9983 14.6823 61.4900 9.8102 11.2307 16.4584 16.0178 0.6103 2.5796 2.3521 3.6812 5.4710 30.2300 3.5578 0.7184 1.0178 1.0217 3.7165 7.6347 2.1286 2.4173 4.3833 6.9483 10.2091 5.3209 6.2427 1.9528 32.1314 39.9635 120.6186 5.1598 1.9690 0.9577 19.2347 1.4622 0.2623 4.5616 9.2942 21.7315 2.9086 8.9886 22.3966 2.5064 3.2274 28.1375 8.5329 3.6348 11.0573 17.2390 97.3407 18.7704 9.6210 17.3028 13.0877 32.7120 61.2971 4.4798 11.8560 31.0969 10.9297 12.4744 7.4884 62.3836 40.8708 25.3790 0.2542 5.8109 17.1846 21.5308 19.1035
temp: 298.150 k
press: 1.00000 atm
elementType: 8 7 6 6 6 6 6 6 6 6 6 6 6 6 6 6 1 1 1 1 1 1 1 1 1 1 1 1 1 1 1 1 1
symmnumber: 1
zpe: 718197.6 jmol-1
zpe.correction: 0.273547 hartree
zpe.thermalcorrener: 0.290183 hartree
zpe.thermalcorrenthalpy: 0.291127 hartree
zpe.thermalcorrgfe: 0.226674 hartree
zpe.sumelectzpe: -672.466463 hartree
zpe.sumelectthermal: -672.449827 hartree
zpe.sumelectthermalent: -672.448883 hartree
zpe.sumelectthermalfe: -672.513336 hartree
dipole: -5.8287 1.7818 -2.8022
dipole: 6.7083
quadrupole: -116.2574 -97.5027 -95.3759
quadrupole: 19.2497 0.3961 -1.7837
quadrupole: -13.2121 5.5426 7.6694 19.2497 0.3961 -1.7837
hfenergy: -672.7400104 hartree
pointgroup: C01 [X(C14H17N1O1)]
dipole: 2.3364344 -0.6699109 -1.0285481 debye
polarizability: 193.556066|18.9913825|139.7513327|-9.8775375|6.1262662|133.350263 unknown
InChI: InChI=1S/C14H17NO/c1-2-7-12(10-6-11-15)14(16)13-8-4-3-5-9-13/h3-5,8-9,12H,2,6-7,10H2,1H3
charge 0 multiplicity 1
33 atoms
O  -0.417198 0.015497 1.884235
N  -5.105893 2.006334 -0.499051
C  -0.980325 -0.841892 -0.30524
C  -0.933175 -2.371095 0.007236
C  -2.43565 -0.319602 -0.155946
C  0.432167 -3.041928 -0.26574
C  -0.052421 -0.094308 0.672508
C  -2.569827 1.183958 -0.528305
C  1.257416 0.494541 0.225908
C  0.400257 -4.559295 0.016927
C  1.768558 0.363418 -1.09479
C  2.017275 1.220551 1.18729
C  -3.967829 1.646798 -0.511691
C  3.006143 0.946388 -1.444004
C  3.249204 1.804033 0.837722
C  3.747865 1.669539 -0.481651
H  -0.654738 -0.688308 -1.351505
H  -1.711719 -2.871764 -0.603537
H  -1.213835 -2.513349 1.069571
H  -2.761113 -0.465426 0.889348
H  -3.09999 -0.919441 -0.805163
H  1.215926 -2.568887 0.35788
H  0.726153 -2.868525 -1.321545
H  -2.152987 1.368627 -1.538176
H  -1.987886 1.801727 0.181959
H  1.38441 -5.024889 -0.172913
H  0.129705 -4.758392 1.07076
H  -0.344584 -5.069191 -0.622949
H  1.213571 -0.196573 -1.853737
H  1.612065 1.307748 2.200849
H  3.391861 0.837479 -2.463412
H  3.822509 2.362811 1.585321
H  4.706485 2.123819 -0.756057
