program: Gaussian 09
title: 000291959
version: EM64L-G09RevD.01
frameworkgroup: C1[X(C9H8O6)]
method: RPBEPBE
basis: SDD
operation: Freq
keyword: #p
keyword: freq=noraman
keyword: PBEPBE/SDD
title: #p freq=noraman PBEPBE/SDD
converged: YES YES NO NO
title: Mulliken charges:
elementType: O O O O O O C C C C C C C C C H H H H H H H H
charge: -0.304437 -0.428734 -0.389082 -0.406648 -0.242376 -0.190218 -0.145719 0.180170 0.143780 -0.328037 -0.316956 -0.231575 -0.205405 0.218681 0.207129 0.280877 0.254179 0.253998 0.229290 0.229371 0.399877 0.399993 0.391841
chargesum: 0.00000
title: Mulliken charges with hydrogens summed into heavy atoms:
elementType: O O O O O O C C C C C C C C C
charge: -0.304437 -0.028857 0.010912 -0.014807 -0.242376 -0.190218 0.135158 0.180170 0.143780 -0.073858 -0.062958 -0.002285 0.023967 0.218681 0.207129
polarizability: 1.53247946e+02 2.97185588e+00 1.25757474e+02 7.46776265e+00 1.13950789e+01 6.60337049e+01
1716.lowfreq: -6.3881 -0.0005 0.0000 0.0006 3.5300 6.3097 27.1738 43.4757 63.0370
frequency: 27.0909 43.4690 63.0345 85.2619 101.1244 147.6882 170.6106 216.9746 222.1080 288.7095 322.0683 367.4286 406.0732 450.9645 466.9543 501.3001 519.2031 552.9223 575.7909 586.8324 602.6309 621.8723 653.0003 682.4116 690.9303 717.0638 756.7922 766.3100 835.7273 849.4641 892.2944 928.0069 934.2020 970.8622 971.7093 1023.8310 1055.3459 1070.6739 1082.4906 1158.1044 1165.1058 1211.5640 1225.9028 1246.7496 1262.0987 1325.0873 1331.9009 1341.1455 1397.9189 1454.5576 1478.2970 1591.3889 1611.0017 1659.1035 1675.6082 3030.8887 3135.4600 3145.0539 3163.3311 3175.8699 3321.2875 3517.7762 3520.2247
redmass: 6.7638 9.8451 6.6660 5.9775 10.1569 7.1230 6.0600 6.9997 7.7092 5.8020 7.7151 7.3721 5.4820 4.6814 4.2096 2.9601 4.1954 4.5691 3.7064 3.6338 1.6533 1.7776 1.2623 3.0530 3.7945 3.7480 1.2862 5.8956 6.3248 1.4340 5.1429 2.6587 1.8142 6.2600 1.3450 2.0266 2.3480 2.2881 2.4876 1.6893 1.2263 1.6379 1.3621 2.0772 1.3017 2.1056 1.7445 2.4093 3.7690 2.3308 3.1089 6.2221 6.6826 9.9857 9.5676 1.0835 1.0855 1.0909 1.0952 1.0995 1.0676 1.0642 1.0645
irintensity: 0.1213 2.1209 0.1870 2.7024 2.7294 2.4954 0.2895 1.2787 1.0681 1.7732 8.0951 5.5877 5.8047 7.4598 0.2846 30.0010 1.1997 7.9808 16.9881 70.0417 133.0626 116.2755 130.4243 153.3748 8.6956 13.4758 87.1936 18.6531 12.9480 0.5098 15.7753 13.4312 9.2051 93.1849 3.2669 23.0736 214.0561 189.5162 48.9163 40.6487 13.2635 134.3319 4.8056 46.7653 4.3461 18.5248 59.1750 57.7483 31.8107 22.0257 108.5358 13.9567 10.4361 240.3878 258.7385 5.5183 0.8041 12.3027 14.4892 13.2727 487.3914 38.2710 45.2992
temp: 298.150 k
press: 1.00000 atm
elementType: 8 8 8 8 8 8 6 6 6 6 6 6 6 6 6 1 1 1 1 1 1 1 1
symmnumber: 1
zpe: 420886.1 jmol-1
zpe.correction: 0.160307 hartree
zpe.thermalcorrener: 0.174047 hartree
zpe.thermalcorrenthalpy: 0.174991 hartree
zpe.thermalcorrgfe: 0.118321 hartree
zpe.sumelectzpe: -797.988029 hartree
zpe.sumelectthermal: -797.974290 hartree
zpe.sumelectthermalent: -797.973346 hartree
zpe.sumelectthermalfe: -798.030015 hartree
dipole: -1.7546 2.3175 3.3017
dipole: 4.3990
quadrupole: -78.5765 -77.4701 -89.6315
quadrupole: 3.5376 -3.2141 -5.0451
quadrupole: 3.3162 4.4226 -7.7388 3.5376 -3.2141 -5.0451
hfenergy: -798.1483364 hartree
pointgroup: C01 [X(C9H8O6)]
dipole: 0.7867469 0.784091 -1.3272231 debye
dipolederiv: -1.2222094 0.1192125 -0.0913973 -0.0369524 -0.3248866 -0.0348985 -0.1813501 -0.0416709 -0.2674459 -0.5827115 0.4387727 -0.0990556 0.4388907 -1.043777 0.2661674 -0.138094 0.331281 -0.5422638 -1.0610295 0.1525324 0.3787754 0.2292535 -0.2997439 -0.1588639 0.522738 -0.1526397 -0.6494459 -0.3819802 -0.0109118 0.040738 0.0238069 -1.1010278 0.3090534 0.0415226 0.2388152 -0.4420015 -0.8021824 0.0799133 0.2255415 -0.2372353 -0.7444801 0.2119409 0.3601115 0.0698391 -0.4665834 -0.7353517 0.1146886 -0.3132436 -0.0959504 -0.5768301 0.0374374 -0.3704029 0.1555399 -0.5288465 0.3899614 -0.191873 -0.1325619 -0.0286253 -0.0182146 0.0426388 -0.2939341 0.1099976 0.2924645 1.0252116 -0.1831262 0.1998308 0.1164758 -0.106986 0.073876 0.2986737 -0.0346765 -0.0268682 0.0324006 -0.3837123 0.1408003 -0.4491982 0.9346067 -0.3431977 0.1887596 -0.3594177 0.2413012 -0.0069662 0.0397671 0.0594961 -0.0427319 -0.0103047 -0.0392721 0.0550253 -0.0163596 -0.1036549 -0.0564023 0.3211036 -0.0625745 0.0035296 -0.1010814 -0.0242124 0.0260302 0.0424769 -0.1788266 -0.224804 -0.0473847 0.0325616 -0.064609 -0.0343123 -0.0716593 0.0145817 -0.0628469 -0.1712131 0.1199788 -0.0150642 0.0828495 0.1377637 0.1002693 -0.0583045 0.0240894 -0.0879718 -0.104596 1.1701951 -0.1982987 -0.6234055 0.0333781 1.021935 -0.112806 -0.7520028 -0.0149968 0.6813064 0.9840206 0.122473 0.4998676 0.2134836 1.3819838 -0.300235 0.5840905 -0.324157 0.6346824 0.0731264 0.019661 -0.0241715 0.0062969 0.0549566 0.0303341 0.0222932 -0.017255 -0.0160647 0.0468586 -0.0956467 -0.0124366 -0.0978465 0.0276112 0.0141657 -0.0209853 0.0152967 0.1476709 0.0301449 -0.0699619 -0.0124883 -0.0859627 -0.0005044 0.0307144 -0.0135792 0.0326636 0.1572498 0.0518761 0.0456252 -0.0427179 0.0613354 -0.0614512 0.0860166 -0.049419 0.0879872 0.1334155 -0.1088042 0.0150636 -0.0746623 0.0153395 0.0993786 0.0222435 -0.0771655 0.0284937 0.1303161 0.6651041 -0.173333 -0.0682929 -0.1116183 0.3451323 0.0041634 -0.0906511 -0.0364365 0.3993904 0.37508 -0.0319286 0.0217826 0.0005567 0.1391778 0.0403465 -0.0005319 0.0741953 0.3769311 0.2184831 -0.067572 -0.1252355 -0.0293804 0.3185487 -0.0256486 -0.1498 -0.0381579 0.3030821 unknown
polarizability: 152.1767698|-3.0380345|124.0997948|10.7168159|-16.0349964|68.7625603 unknown
InChI: InChI=1S/C9H8O6/c10-5-3-1-2-4-6(5)15-7(8(11)12)9(13)14/h1-4,7,10-11,13H
charge 0 multiplicity 1
23 atoms
O  0.311147 0.19001 0.72519
O  -1.473265 -2.00772 0.781583
O  2.962321 -1.530565 -1.120752
O  2.360778 2.269953 -0.229255
O  1.269025 -2.347595 0.2415
O  3.446681 0.657145 1.056717
C  1.406571 0.075585 -0.238652
C  -1.009317 0.340564 0.181567
C  -1.880181 -0.780614 0.283046
C  -1.446553 1.57327 -0.338817
C  -3.224865 -0.62653 -0.135613
C  -2.785078 1.707986 -0.770638
C  -3.668737 0.605648 -0.658373
C  1.850266 -1.39308 -0.316124
C  2.536322 0.981947 0.274608
H  1.098073 0.414436 -1.245216
H  -0.745488 2.414599 -0.379348
H  -3.894237 -1.487622 -0.048371
H  -3.136894 2.662802 -1.173834
H  -4.710696 0.706431 -0.980971
H  -0.475591 -2.055067 0.884436
H  3.264413 -2.478373 -1.15646
H  3.042705 2.882589 0.159478
