program: Gaussian 09
title: 000291974
version: EM64L-G09RevD.01
frameworkgroup: C1[X(C10H17NO6)]
method: RPBEPBE
basis: SDD
operation: Freq
keyword: #p
keyword: freq=noraman
keyword: PBEPBE/SDD
title: #p freq=noraman PBEPBE/SDD
converged: YES YES NO NO
title: Mulliken charges:
elementType: O O O O O O N C C C C C C C C C C H H H H H H H H H H H H H H H H H
charge: -0.285248 -0.258038 -0.234792 -0.255827 -0.202138 -0.199833 0.126255 -0.128747 -0.413882 -0.586146 -0.391340 0.212743 0.254636 -0.257343 -0.262757 -0.661639 -0.661241 0.261841 0.243062 0.241330 0.260349 0.295725 0.307135 0.268320 0.239243 0.226203 0.226948 0.235328 0.249873 0.229111 0.222624 0.247672 0.230046 0.220528
chargesum: 0.00000
title: Mulliken charges with hydrogens summed into heavy atoms:
elementType: O O O O O O N C C C C C C C C C C
charge: -0.285248 -0.258038 -0.234792 -0.255827 -0.202138 -0.199833 0.126255 0.133094 0.070510 -0.030072 0.184114 0.212743 0.254636 0.208103 0.199518 0.039969 0.037005
polarizability: 1.62947606e+02 -4.41201197e-01 1.34666361e+02 7.92360185e+00 -6.86804197e+00 1.12529338e+02
1716.lowfreq: -8.3205 -5.6158 -2.7145 -0.0011 -0.0007 -0.0001 13.3788 15.9970 22.2347
frequency: 13.3540 15.9348 22.1645 31.2893 36.4203 57.0739 68.0682 73.1834 91.9577 108.1478 116.1942 139.4738 180.2212 210.0435 220.5218 241.3815 261.3746 280.1158 310.6518 334.9072 343.5221 402.3665 437.5588 493.8089 524.5112 543.3287 568.2327 600.9648 646.2149 658.2524 704.0294 753.8049 775.9831 807.0108 815.8052 818.1931 844.6368 876.7575 888.5933 912.3989 1003.5463 1011.0348 1037.5992 1046.4321 1083.0485 1095.6314 1096.4101 1125.3193 1140.6767 1147.5941 1156.2371 1157.7873 1181.6373 1198.0463 1231.5303 1251.1664 1274.5420 1277.9213 1278.4445 1294.1746 1316.8417 1343.9242 1351.5637 1356.1684 1363.9341 1392.7326 1393.0354 1417.5620 1442.4841 1454.4800 1457.6677 1457.9554 1462.7724 1463.2294 1464.1640 1483.6375 1484.7346 1626.0863 1630.3733 2969.4067 2994.6527 2994.6984 3011.1001 3021.8897 3032.0262 3034.0677 3034.3727 3067.3210 3079.3787 3089.7171 3089.8728 3095.1930 3095.7413 3110.7703 3121.5028 3121.9531
redmass: 5.0771 10.3571 4.9394 3.8373 5.7276 3.6613 3.3299 3.5678 3.3369 3.9647 2.6511 3.6111 1.9219 1.4338 1.7722 3.5666 3.5991 2.3699 3.0943 4.2609 3.6662 3.4324 3.5673 3.9095 4.8081 3.5450 3.5006 4.0066 5.0070 5.6379 2.7637 1.8656 1.8987 1.6903 2.0390 1.6242 7.6063 2.8283 2.3597 3.1057 2.5341 2.7866 2.1292 3.1124 3.2696 2.1729 2.1649 3.3566 2.3042 2.4065 1.6795 1.8083 1.2985 1.4311 3.6741 1.4865 1.3494 1.1268 1.1211 1.4327 1.2904 1.5279 1.4224 1.3495 1.6390 1.2334 1.2314 2.9840 1.0876 1.2193 1.0989 1.0960 1.1090 1.0444 1.0454 1.0514 1.0517 9.9366 8.6517 1.0808 1.0361 1.0361 1.0614 1.0608 1.0597 1.0594 1.0595 1.0987 1.1017 1.0975 1.0974 1.1030 1.1032 1.1044 1.1064 1.1068
irintensity: 1.6112 0.2191 1.0931 0.1056 1.4583 3.0111 3.9047 1.9473 0.8718 5.9592 0.3883 4.9912 3.8485 3.9229 3.2438 2.0557 1.9833 7.0485 21.0168 2.3014 8.7059 14.9510 3.0338 10.5905 6.9917 0.3035 4.0872 14.8003 3.5856 10.3483 12.9849 23.3732 12.0320 0.2207 1.7922 7.6973 6.6555 29.3198 24.9091 8.5900 3.5889 126.1524 137.5047 6.6633 3.3255 44.9950 11.9894 105.5959 263.6345 14.9030 24.6509 11.0955 22.9419 76.9728 59.8624 132.9992 24.4777 1.0878 4.9853 90.2794 9.2378 9.0723 14.7929 4.6138 18.0988 22.2924 26.7229 148.6357 40.4561 6.0456 11.6611 10.0075 16.2902 15.5786 16.9022 13.3252 12.7990 273.4133 48.2695 10.3717 18.5870 13.3730 13.8324 10.9418 30.0634 12.7309 25.0749 6.0102 12.9552 37.9196 29.4957 1.0290 1.6275 8.0835 31.4092 26.3858
temp: 298.150 k
press: 1.00000 atm
elementType: 8 8 8 8 8 8 7 6 6 6 6 6 6 6 6 6 6 1 1 1 1 1 1 1 1 1 1 1 1 1 1 1 1 1
symmnumber: 1
zpe: 709650.2 jmol-1
zpe.correction: 0.270291 hartree
zpe.thermalcorrener: 0.290171 hartree
zpe.thermalcorrenthalpy: 0.291115 hartree
zpe.thermalcorrgfe: 0.216040 hartree
zpe.sumelectzpe: -895.938859 hartree
zpe.sumelectthermal: -895.918979 hartree
zpe.sumelectthermalent: -895.918035 hartree
zpe.sumelectthermalfe: -895.993110 hartree
dipole: 0.5692 -3.5040 -0.1182
dipole: 3.5519
quadrupole: -73.8652 -127.6494 -104.0024
quadrupole: 9.4098 2.5046 -0.3876
quadrupole: 27.9738 -25.8104 -2.1634 9.4098 2.5046 -0.3876
hfenergy: -896.2091501 hartree
pointgroup: C01 [X(C10H17N1O6)]
dipole: -0.4629881 1.3074449 0.1704586 debye
polarizability: 159.6388911|6.7593548|133.8446889|-13.5254687|7.224168|116.6597256 unknown
InChI: InChI=1S/C10H17NO6/c1-3-16-9(12)7-8(5-6-11(14)15)10(13)17-4-2/h8H,3-7H2,1-2H3
charge 0 multiplicity 1
34 atoms
O  2.161668 1.650271 -0.757654
O  -3.70826 0.761015 0.667171
O  0.675836 3.248111 0.051807
O  -2.692743 -0.045183 -1.273396
O  1.465096 -2.9225 0.49606
O  2.248338 -3.217183 -1.624482
N  1.653895 -2.529097 -0.714435
C  -0.142279 0.96269 -0.458218
C  0.378428 -0.437718 -0.013091
C  -1.419254 1.36264 0.31195
C  1.156247 -1.143406 -1.127234
C  0.901174 2.078481 -0.336654
C  -2.635325 0.609262 -0.20308
C  3.271304 2.660216 -0.700915
C  -4.994601 0.093826 0.279642
C  3.914371 2.676537 0.687424
C  -5.020365 -1.355277 0.771571
H  -0.416793 0.902247 -1.533346
H  -0.49124 -1.060852 0.259304
H  1.005109 -0.346607 0.890793
H  -1.313653 1.184998 1.397228
H  -1.603993 2.447931 0.201612
H  2.054201 -0.578122 -1.424338
H  0.535179 -1.313201 -2.024224
H  2.854473 3.647091 -0.966394
H  3.969559 2.316962 -1.48072
H  -5.761404 0.713545 0.770654
H  -5.100926 0.150042 -0.817864
H  3.197497 3.027486 1.448337
H  4.276036 1.672563 0.96901
H  4.778991 3.365797 0.687122
H  -4.250146 -1.957989 0.261941
H  -4.853547 -1.405894 1.861255
H  -6.007176 -1.803682 0.55266
