program: Gaussian 09
title: 000291958
version: EM64L-G09RevD.01
frameworkgroup: C1[X(C14H11NO4)]
method: RPBEPBE
basis: SDD
operation: Freq
keyword: #p
keyword: freq=noraman
keyword: PBEPBE/SDD
title: #p freq=noraman PBEPBE/SDD
converged: YES YES NO NO
title: Mulliken charges:
elementType: O O O O N C C C C C C C C C C C C C C H H H H H H H H H H H
charge: -0.440787 -0.208167 -0.192212 -0.244612 0.006516 0.134971 0.259808 0.350925 0.259764 0.117492 -0.426578 -0.359184 -0.392464 -0.838807 -0.207885 -0.330160 -0.223122 -0.226340 0.084309 0.240309 0.252266 0.280769 0.227988 0.242593 0.255682 0.237404 0.281296 0.235777 0.236120 0.386329
chargesum: 0.00000
title: Mulliken charges with hydrogens summed into heavy atoms:
elementType: O O O O N C C C C C C C C C C C C C C
charge: -0.054459 -0.208167 -0.192212 -0.244612 0.006516 0.134971 0.259808 0.350925 0.259764 0.117492 -0.186269 -0.106918 -0.111695 -0.112544 0.029519 -0.048864 0.012655 0.009780 0.084309
polarizability: 2.21529442e+02 1.07401695e+01 1.56266782e+02 -6.12198437e+00 -4.78907122e+00 1.41894933e+02
1716.lowfreq: -9.2367 -0.0008 -0.0007 -0.0006 1.5593 9.2652 31.2316 35.7895 57.5590
frequency: 31.2214 35.7238 57.5504 63.7531 82.5750 104.6852 128.6486 135.7899 178.5738 199.9178 224.1259 255.6152 290.0308 312.0013 358.9854 387.6541 407.0234 419.8451 457.7270 490.7604 515.9051 530.1900 559.1971 585.9228 593.3665 602.3096 636.6918 683.0127 688.9985 704.7124 739.0306 751.1279 763.0977 785.0966 792.6808 805.1732 885.2884 900.1257 923.0467 974.0670 987.1955 991.9175 1001.9008 1003.4479 1007.4841 1044.7146 1048.3255 1096.3996 1115.7451 1155.6017 1162.3167 1178.9908 1182.6345 1217.8751 1246.8043 1262.1683 1280.4923 1317.0297 1363.7926 1370.1868 1374.3715 1399.7103 1421.2345 1431.1095 1461.3868 1468.9088 1478.3649 1491.4264 1574.7495 1578.4723 1602.0096 1609.8388 1639.2109 2985.2374 3065.7814 3092.5281 3131.5184 3133.2101 3146.1589 3159.4133 3162.5044 3183.5037 3187.4829 3530.5762
redmass: 6.8866 10.6062 9.9035 5.2973 5.5788 4.5184 4.0540 1.1945 5.3390 4.0754 4.1524 7.2880 4.6626 5.0468 5.4032 5.7456 5.7474 3.1947 4.1507 6.3446 4.9355 4.3634 3.6766 2.1154 1.8237 4.5145 7.1274 6.6764 3.8166 6.8193 3.4483 4.6377 2.1219 5.7281 2.1351 1.6899 2.3927 1.9812 1.3578 1.3920 1.3590 6.7819 3.8946 1.3533 1.8294 1.6754 1.9916 1.7615 1.6824 2.4258 1.7237 1.0788 1.3951 10.8969 2.3819 1.8910 1.7601 2.5732 11.8179 6.7442 9.0702 1.2462 2.1557 2.2713 2.8227 1.0630 1.1534 3.1792 6.8509 7.0530 6.3524 7.0905 8.4982 1.0372 1.0967 1.0996 1.0865 1.0886 1.0913 1.0933 1.0967 1.0967 1.0964 1.0642
irintensity: 0.4959 1.0813 1.3158 0.6615 0.8610 0.8463 1.3763 0.8658 0.5426 2.7775 1.6941 1.3923 1.7985 0.4835 2.0516 8.9401 2.6400 9.7258 4.2015 5.9123 1.3379 6.7163 14.8808 48.7112 46.2007 35.1313 5.5823 8.6029 51.0933 8.8920 24.4298 24.2797 50.3363 2.7960 16.7167 29.9985 5.3032 2.9289 1.4417 2.3322 2.4802 77.6620 170.3171 0.6480 39.8830 13.9559 3.9132 41.5382 41.9384 2.4105 72.8245 0.6216 1.6501 232.8375 0.9743 5.4113 2.5784 89.5043 138.9653 20.0648 6.8367 15.1655 7.2757 0.9052 44.9166 18.8167 29.8276 4.4049 6.5963 24.7447 7.7822 5.8047 259.0842 18.8506 10.1597 21.2656 1.4525 9.1245 11.4723 17.9514 18.3417 8.0270 4.7230 51.6951
temp: 298.150 k
press: 1.00000 atm
elementType: 8 8 8 8 7 6 6 6 6 6 6 6 6 6 6 6 6 6 6 1 1 1 1 1 1 1 1 1 1 1
symmnumber: 1
zpe: 576510.2 jmol-1
zpe.correction: 0.219581 hartree
zpe.thermalcorrener: 0.236195 hartree
zpe.thermalcorrenthalpy: 0.237140 hartree
zpe.thermalcorrgfe: 0.174071 hartree
zpe.sumelectzpe: -894.333958 hartree
zpe.sumelectthermal: -894.317344 hartree
zpe.sumelectthermalent: -894.316400 hartree
zpe.sumelectthermalfe: -894.379469 hartree
dipole: 1.0196 -4.2246 -2.4141
dipole: 4.9714
quadrupole: -93.9363 -116.4866 -100.0693
quadrupole: 6.9240 0.9060 -4.0675
quadrupole: 9.5611 -12.9892 3.4281 6.9240 0.9060 -4.0675
hfenergy: -894.5535395 hartree
pointgroup: C01 [X(C14H11N1O4)]
dipole: -0.3624896 1.6988109 -0.8989732 debye
polarizability: 223.1546412|6.7134593|155.0239331|0.412108|4.0986356|141.5125835 unknown
InChI: InChI=1S/C14H11NO4/c1-9-5-4-8-12(15(18)19)13(9)10-6-2-3-7-11(10)14(16)17/h2-8,16H,1H3
charge 0 multiplicity 1
30 atoms
O  -2.370806 0.968871 2.696432
O  2.014735 -3.065875 0.253693
O  0.008143 -2.193947 0.885452
O  -0.12937 1.16847 2.148907
N  1.195434 -2.074557 0.393863
C  0.743024 0.293671 -0.362905
C  -0.732612 0.040506 -0.524051
C  1.274135 1.572799 -0.714986
C  1.666896 -0.727289 -0.01487
C  -1.713052 0.342156 0.46823
C  2.675075 1.774517 -0.690483
C  -1.169866 -0.470446 -1.771141
C  3.065514 -0.528567 -0.001743
C  0.351879 2.720058 -1.081487
C  3.569407 0.738332 -0.338739
C  -3.088226 0.117996 0.200095
C  -2.539968 -0.691587 -2.032218
C  -3.505086 -0.393519 -1.044327
C  -1.293404 0.853267 1.799573
H  3.068923 2.763334 -0.951975
H  -0.424023 -0.704277 -2.538849
H  3.718367 -1.360937 0.271708
H  0.927219 3.591812 -1.435283
H  -0.369293 2.438122 -1.869239
H  -0.238582 3.037631 -0.201809
H  4.648543 0.920681 -0.325639
H  -3.815584 0.341702 0.984556
H  -2.849549 -1.096318 -3.002031
H  -4.568745 -0.564601 -1.239628
H  -2.018725 1.294898 3.567692
