program: Gaussian 09
title: 000291956
version: EM64L-G09RevD.01
frameworkgroup: C1[X(C9H8INO4)]
method: RPBEPBE
basis: SDD
operation: Freq
keyword: #p
keyword: freq=noraman
keyword: PBEPBE/SDD
title: #p freq=noraman PBEPBE/SDD
converged: YES YES NO NO
title: Mulliken charges:
elementType: I O O O O N C C C C C C C C C H H H H H H H H
charge: 0.193070 -0.247603 -0.238596 -0.189331 -0.167326 -0.005560 0.405511 -0.629160 0.539212 -0.359872 -0.327161 -0.203817 0.151812 -0.244314 -0.662904 0.279926 0.283886 0.251824 0.238533 0.229319 0.222594 0.233518 0.246437
chargesum: 0.00000
title: Mulliken charges with hydrogens summed into heavy atoms:
elementType: I O O O O N C C C C C C C C C
charge: 0.193070 -0.247603 -0.238596 -0.189331 -0.167326 -0.005560 0.405511 -0.629160 0.539212 -0.079945 -0.043275 0.048007 0.151812 0.223538 0.039646
polarizability: 1.78811619e+02 9.27684129e+00 1.76264950e+02 5.50119258e+00 -6.92861147e+00 7.59549938e+01
1716.lowfreq: -8.2405 -3.5184 -0.0001 0.0005 0.0007 5.0906 23.4555 33.3431 49.2601
frequency: 23.3954 33.3313 49.2364 57.7925 64.6655 115.9032 145.8899 161.4443 174.3340 217.7520 228.3482 267.5198 311.6318 340.2637 356.0222 404.1057 439.8081 453.4944 507.5792 592.6326 659.2695 669.9184 672.1808 719.9788 737.3873 752.8699 800.3413 813.9912 830.4269 866.8095 942.6940 995.1242 997.2906 1005.1659 1074.4575 1096.3253 1126.1113 1147.8970 1158.2475 1198.0143 1215.1773 1259.9493 1278.6319 1351.5935 1359.4223 1379.2218 1392.1743 1402.5976 1434.3388 1455.7143 1463.9051 1484.5274 1565.1261 1584.4352 1608.0758 2995.1980 3031.5224 3090.8635 3096.0338 3121.8115 3156.6225 3170.4152 3185.6465
redmass: 5.0994 5.1843 8.2572 7.6486 4.0975 4.1564 13.4711 6.5590 6.5052 1.5278 4.8585 3.5210 3.1159 8.0747 7.9144 4.3828 8.3967 4.8701 3.9289 6.1834 8.9893 9.1659 6.0942 3.9498 3.7571 3.0532 3.1322 1.6450 2.0137 4.7963 1.4071 1.4041 6.0483 2.7922 4.3642 2.1633 1.7642 2.2526 1.7128 1.4414 8.4220 2.9701 1.1366 2.3072 2.4037 6.6637 1.2326 2.9855 2.5838 1.1095 1.0425 1.0525 6.3455 6.5145 9.7647 1.0361 1.0591 1.0974 1.1036 1.1066 1.0877 1.0926 1.0997
irintensity: 1.3085 0.5015 0.6957 0.9375 3.8035 2.1463 2.2586 2.1363 0.7196 2.9825 0.2543 1.4666 12.6690 6.6056 2.6332 2.7238 5.2376 1.6706 2.3396 1.9686 10.1089 18.1101 19.5858 10.0780 20.7850 16.7284 16.6557 7.6510 30.2393 5.6449 2.2216 3.3596 28.0764 29.2996 187.5194 11.1705 39.2494 17.6536 26.7288 68.3595 184.1481 186.6974 17.3002 6.4105 4.6463 84.3558 21.5530 92.8033 12.1077 15.2734 16.7412 14.0159 6.9755 20.9729 197.0527 18.2580 23.0021 31.3770 0.8611 25.1315 1.5898 2.6732 3.1446
temp: 298.150 k
press: 1.00000 atm
elementType: 53 8 8 8 8 7 6 6 6 6 6 6 6 6 6 1 1 1 1 1 1 1 1
symmnumber: 1
zpe: 414462.1 jmol-1
zpe.correction: 0.157860 hartree
zpe.thermalcorrener: 0.172729 hartree
zpe.thermalcorrenthalpy: 0.173673 hartree
zpe.thermalcorrgfe: 0.112182 hartree
zpe.sumelectzpe: -713.715900 hartree
zpe.sumelectthermal: -713.701032 hartree
zpe.sumelectthermalent: -713.700088 hartree
zpe.sumelectthermalfe: -713.761579 hartree
dipole: -3.8139 1.9649 0.6893
dipole: 4.3453
quadrupole: -105.2282 -86.7555 -105.8228
quadrupole: 12.7017 -6.1084 5.8706
quadrupole: -5.9594 12.5133 -6.5539 12.7017 -6.1084 5.8706
hfenergy: -713.8737606 hartree
pointgroup: C01 [X(C9H8I1N1O4)]
dipole: -1.4297761 0.7965623 0.4937897 debye
dipolederiv: 0.1754335 -0.1109007 -0.0228784 -0.1112229 -0.3017897 -0.1116298 -0.0452602 -0.1478971 0.0519959 -1.1875577 -0.2822307 0.2830621 -0.5936171 -0.7333176 0.3704099 0.3816877 0.2881466 -0.5067588 -0.8442658 0.2416608 -0.1905571 -0.0582929 -0.5933094 0.2718576 0.001349 0.2447263 -0.5079729 -0.8507745 -0.0815996 0.1949153 0.0464716 -0.3747082 0.1335443 0.1633829 0.1458269 -0.334921 -0.4592621 0.0820584 0.0261948 0.1162456 -0.5747605 0.2709697 0.1145601 0.1957664 -0.33492 1.355505 -0.1451235 -0.2688205 -0.4850311 0.8452665 -0.4960037 -0.3345369 -0.3744499 0.462303 -0.3742224 -0.0261538 -0.0146571 -0.0635899 -0.4890447 -0.0836845 -0.1141912 -0.086451 -0.0068417 0.1702267 0.082178 0.0639375 0.1680065 0.8680021 0.3544789 0.0779282 0.3732057 -0.0304115 -0.3479264 0.0700676 -0.0018374 0.1018228 -0.3697738 -0.0255081 0.0118724 -0.0841247 0.0343307 0.059503 0.0393918 0.0358747 0.0834635 0.1127795 0.0354055 -0.0130054 0.0239458 -0.079046 -0.0187202 -0.0333286 -0.0055146 -0.1515455 0.1130409 0.0239646 0.0626717 -0.0150792 -0.0716037 -0.2411187 0.0636103 -0.0024742 0.0864534 0.1031748 0.0214015 0.0169155 0.0122695 -0.1334105 1.611925 -0.0495263 0.0649184 0.6737568 0.9767107 -0.6719451 -0.1835417 -0.5579611 0.6567758 0.8819642 0.2276059 -0.1970534 0.1748507 0.3304553 -0.0469323 -0.1096209 0.0176609 0.2979687 -0.1195015 -0.0045259 0.0933681 0.0133799 -0.0168542 -0.0429515 0.0647839 -0.0741171 -0.0361981 0.0599259 0.0626988 -0.003759 0.0532943 0.0513555 -0.0213824 0.0103055 0.0070179 0.1493958 0.0327685 -0.0277511 -0.0220838 -0.0006469 0.0916827 -0.0232928 -0.028698 0.0163096 0.1586968 0.0686737 -0.0320601 -0.0111387 -0.032593 -0.059142 -0.0260203 -0.022159 -0.0328588 0.1548896 -0.0311844 -0.0355857 0.0139024 0.0312658 0.0772911 0.0603099 -0.0533173 -0.0109875 -0.084066 -0.0015923 0.0265368 0.0426268 -0.0329505 -0.1206377 -0.0097898 0.018673 0.0025082 0.0890088 -0.1594278 -0.0878064 0.0221895 -0.083321 0.0863788 -0.0170409 0.0252815 -0.0057441 0.0875 0.0812618 0.0387637 -0.1019574 0.044309 0.0797522 0.0379994 -0.0457316 0.0237921 -0.0933591 0.1383666 -0.0179799 0.0017419 0.0194911 -0.1025523 -0.0041603 0.0006508 0.0384946 0.0766441 unknown
polarizability: 180.1299433|8.7422431|175.229635|-0.6022468|7.372115|75.6719845 unknown
InChI: InChI=1S/C9H8INO4/c1-2-15-9(12)6-4-3-5-7(8(6)10)11(13)14/h3-5H,2H2,1H3
charge 0 multiplicity 1
23 atoms
I  0.140428 -2.345496 -0.744108
O  -2.380434 -0.742244 0.381588
O  -2.759953 1.169986 -0.895544
O  4.128233 -0.363571 -0.505532
O  2.928621 -1.896795 0.685851
N  3.044527 -0.77867 0.061864
C  -0.502873 0.661915 -0.137474
C  0.535109 -0.314774 -0.170602
C  1.868978 0.137661 0.022803
C  -0.178185 2.034706 0.034793
C  2.183614 1.504068 0.198337
C  1.15263 2.458911 0.202913
C  -1.978589 0.395468 -0.290006
C  -3.830629 -1.112263 0.291944
C  -4.624131 -0.442643 1.415706
H  -1.001037 2.756039 0.020222
H  3.233278 1.787403 0.315484
H  1.384055 3.519537 0.334532
H  -4.205027 -0.816226 -0.703516
H  -3.815844 -2.209657 0.387432
H  -5.667384 -0.808633 1.399341
H  -4.190098 -0.683655 2.401074
H  -4.64229 0.65253 1.288099
