program: Gaussian 09
title: 000291970
version: EM64L-G09RevD.01
frameworkgroup: C1[X(C16H17N3O2)]
method: RPBEPBE
basis: SDD
operation: Freq
keyword: #p
keyword: freq=noraman
keyword: PBEPBE/SDD
title: #p freq=noraman PBEPBE/SDD
converged: YES YES NO NO
title: Mulliken charges:
elementType: O O N N N C C C C C C C C C C C C C C C C H H H H H H H H H H H H H H H H H
charge: -0.200330 -0.265636 -0.447868 -0.022764 0.000197 0.082103 -0.435550 -0.497405 0.177059 0.145511 -0.456834 -0.439919 -0.771728 0.492542 -0.128073 -0.167427 -0.455328 -0.323573 -0.197079 -0.216599 -0.247760 0.226325 0.269841 0.276384 0.221531 0.257748 0.279851 0.262853 0.273329 0.238252 0.249990 0.288735 0.311372 0.222713 0.303995 0.230741 0.230289 0.232513
chargesum: 0.00000
title: Mulliken charges with hydrogens summed into heavy atoms:
elementType: O O N N N C C C C C C C C C C C C C C C C
charge: -0.200330 -0.265636 -0.136496 -0.022764 0.000197 0.082103 0.060616 0.000510 0.177059 0.145511 0.080765 0.096263 0.005248 0.492542 -0.128073 -0.167427 -0.232615 -0.019578 0.033662 0.013691 -0.015247
polarizability: 2.44085781e+02 -1.09579306e+01 1.82186481e+02 -1.87544770e+00 -2.49499449e+01 1.44212866e+02
1716.lowfreq: -4.6062 -0.0006 -0.0003 0.0001 3.8985 7.6272 24.2269 27.5535 33.8577
frequency: 24.1040 27.5373 33.8019 37.7862 55.5855 63.4764 85.6117 94.8921 114.1426 134.1019 147.7355 156.1359 176.6655 184.7653 226.7600 244.9793 272.6455 278.9127 319.1205 331.8861 345.2543 351.3040 353.1114 379.9571 406.0211 445.1025 466.7127 512.2364 527.9645 551.4271 561.8895 602.8809 613.8474 640.4564 657.4305 694.2128 702.7882 719.0195 770.6226 778.3642 808.6274 840.9060 849.0042 886.0081 899.0869 919.9122 938.8949 971.0483 973.6785 974.9547 985.2908 986.1248 1000.2920 1015.7143 1026.3883 1055.3180 1067.2662 1085.3909 1091.5741 1102.0628 1164.7362 1174.3227 1180.0049 1189.6614 1197.1643 1226.1528 1249.3292 1268.8292 1278.8646 1304.3660 1321.1775 1329.1632 1341.7051 1356.5592 1372.5910 1387.6236 1426.2947 1432.8339 1435.6838 1445.7533 1450.5167 1461.2839 1481.9511 1485.7946 1514.2038 1589.0279 1604.1706 1613.6851 1618.2495 2198.2034 2201.5493 2979.6598 2996.2587 2997.4530 3005.6364 3009.0708 3041.5960 3063.3364 3065.7276 3072.6125 3084.2024 3107.3631 3121.1739 3136.0906 3149.2167 3168.4031 3206.2975 3523.2025
redmass: 4.4376 6.4179 7.6074 8.7571 6.9707 5.5293 4.6811 4.4360 4.2442 3.3438 4.9061 1.6846 2.3585 4.8451 3.6960 3.9878 2.3111 4.7064 3.8455 6.2557 4.1843 4.3618 3.3825 3.6441 2.8855 3.6531 5.6811 2.7711 3.9940 5.7091 3.4618 3.9010 6.3348 1.2259 3.3246 1.9970 4.5247 2.6631 1.7180 1.5438 3.7373 1.3074 3.7744 2.9793 3.4261 1.4428 3.6769 2.3381 2.3692 1.3698 2.3115 5.1062 1.3198 2.1490 2.2120 3.6377 2.5331 2.2790 2.4111 2.9124 1.7415 1.0688 2.8593 1.1135 1.2291 1.3154 2.0125 1.1878 1.4135 1.2954 1.4227 1.3646 1.3445 1.3536 1.2003 6.5468 2.0174 1.1259 1.1073 1.0797 1.0960 1.0845 1.5391 1.6954 1.7382 6.9132 4.4930 6.1357 8.2756 12.4332 12.4339 1.0649 1.0565 1.0393 1.0595 1.0609 1.0963 1.1009 1.0998 1.1028 1.0947 1.0894 1.1029 1.0868 1.0933 1.1001 1.0948 1.0755
irintensity: 0.7459 2.3225 2.6187 3.6938 6.6607 5.3017 4.2924 2.0868 1.4176 1.8135 2.0452 4.6493 11.5097 9.0506 3.2812 6.4078 4.2783 4.2955 0.7006 2.4723 3.0706 0.8897 1.7874 1.0114 0.0720 4.1479 4.4134 17.2252 4.8260 10.2610 6.3299 7.3386 0.4806 31.6937 8.2280 47.7420 5.6890 6.3954 88.4780 5.4660 3.1183 1.0222 7.6302 1.1470 17.4526 10.4788 2.2121 2.1841 3.1353 0.0775 1.6284 0.0421 1.4324 6.4329 4.5634 2.1763 21.2679 17.5688 5.2444 5.0911 45.3776 3.2300 50.8386 0.7229 3.0460 13.7311 12.6221 1.2540 5.5558 4.5622 37.0458 2.9589 3.2039 1.8752 76.2552 41.6344 163.7074 8.9028 27.1243 20.7056 8.6941 17.6040 9.6263 155.1822 195.9971 186.8668 5.0205 17.5243 69.1518 9.5492 10.4430 13.1651 4.8291 6.0505 20.3219 9.8220 3.5059 10.6199 5.6958 6.0680 7.0778 14.3080 18.2248 0.5141 24.1039 24.3692 4.5479 12.6059
temp: 298.150 k
press: 1.00000 atm
elementType: 8 8 7 7 7 6 6 6 6 6 6 6 6 6 6 6 6 6 6 6 6 1 1 1 1 1 1 1 1 1 1 1 1 1 1 1 1 1
symmnumber: 1
zpe: 781146.8 jmol-1
zpe.correction: 0.297523 hartree
zpe.thermalcorrener: 0.318776 hartree
zpe.thermalcorrenthalpy: 0.319720 hartree
zpe.thermalcorrgfe: 0.245017 hartree
zpe.sumelectzpe: -933.055679 hartree
zpe.sumelectthermal: -933.034427 hartree
zpe.sumelectthermalent: -933.033482 hartree
zpe.sumelectthermalfe: -933.108185 hartree
dipole: 0.3595 0.6687 1.0163
dipole: 1.2685
quadrupole: -126.8117 -148.4719 -122.4285
quadrupole: -16.4951 -2.3063 2.1520
quadrupole: 5.7590 -15.9012 10.1422 -16.4951 -2.3063 2.1520
hfenergy: -933.3532025 hartree
pointgroup: C01 [X(C16H17N3O2)]
dipole: -0.2075674 0.2767768 -0.3597055 debye
polarizability: 240.2995404|17.5367004|180.6216116|-16.0252608|24.4255132|149.563976 unknown
InChI: InChI=1S/C16H17N3O2/c1-13(20)16(9-5-11-17,10-6-12-18)15(21)19-14-7-3-2-4-8-14/h2-4,7-8,19H,5-6,9-10H2,1H3
charge 0 multiplicity 1
38 atoms
O  -4.01326 -1.276928 0.076809
O  -0.236499 -1.311219 -1.115524
N  0.581636 0.31329 0.361417
N  1.384341 -3.319736 1.528715
N  -2.435625 4.318616 1.909435
C  -1.766078 -0.49937 0.612229
C  -1.764813 -1.625184 1.706598
C  -2.11329 0.837278 1.356971
C  -2.956772 -0.769564 -0.384049
C  -0.409536 -0.517712 -0.137458
C  -1.251187 -3.02253 1.246901
C  -2.234695 2.097266 0.449571
C  -2.859745 -0.36494 -1.84248
C  1.937515 0.454644 -0.07543
C  0.206919 -3.187678 1.386286
C  -2.350079 3.329417 1.247816
C  2.701972 1.485256 0.533804
C  2.527725 -0.380255 -1.059061
C  4.046644 1.683504 0.163072
C  3.875314 -0.166236 -1.420739
C  4.64121 0.858587 -0.82015
H  -1.177531 -1.287439 2.580061
H  -2.816186 -1.739217 2.02595
H  -3.073375 0.68292 1.882847
H  -1.367245 1.024997 2.155166
H  -1.739335 -3.803213 1.859734
H  -1.529408 -3.214543 0.194764
H  -1.354415 2.192242 -0.21531
H  -3.124778 2.019528 -0.201744
H  -2.272256 0.556698 -1.993599
H  -3.873522 -0.25702 -2.260032
H  -2.31816 -1.156288 -2.391782
H  0.337042 0.888086 1.171047
H  2.246744 2.130928 1.296838
H  1.938747 -1.176607 -1.514998
H  4.627384 2.479885 0.640618
H  4.330293 -0.815873 -2.176361
H  5.686402 1.01071 -1.10903
