program: Gaussian 09
title: 000291945
version: EM64L-G09RevD.01
frameworkgroup: C1[X(C15H14ClNO2)]
method: RPBEPBE
basis: SDD
operation: Freq
keyword: #p
keyword: freq=noraman
keyword: PBEPBE/SDD
title: #p freq=noraman PBEPBE/SDD
converged: YES YES NO NO
title: Mulliken charges:
elementType: Cl O O N C C C C C C C C C C C C C C C H H H H H H H H H H H H H H
charge: -0.071238 -0.420268 -0.267324 -0.479454 -0.411635 0.378226 0.413223 0.206602 0.247842 -0.337368 -0.557232 -0.402022 -0.424953 -0.394977 0.310715 -0.352417 -0.280948 -0.077295 -0.536689 0.231100 0.197372 0.226936 0.296030 0.261280 0.235019 0.227019 0.251862 0.244585 0.253744 0.347751 0.218619 0.219996 0.245899
chargesum: 0.00000
title: Mulliken charges with hydrogens summed into heavy atoms:
elementType: Cl O O N C C C C C C C C C C C C C C C
charge: -0.071238 -0.072517 -0.267324 -0.183424 -0.180536 0.378226 0.413223 0.206602 0.247842 0.086940 -0.295953 -0.167003 -0.197934 -0.143115 0.310715 -0.107831 -0.027204 -0.077295 0.147824
polarizability: 3.20150136e+02 4.55471843e+00 1.68362092e+02 -1.49542227e+00 -2.68253875e+01 1.04231933e+02
1716.lowfreq: -8.7341 -3.3207 -0.0015 -0.0009 -0.0007 3.6694 33.5478 59.4454 72.0105
frequency: 33.5278 59.4448 72.0104 89.9256 103.1766 123.4523 143.5705 190.9654 207.4306 218.4864 246.5753 248.8496 257.7249 315.9448 333.5398 368.3317 371.6786 391.3477 409.6894 437.4905 456.8907 490.9030 496.9874 534.2521 542.9111 578.9693 582.1143 632.0818 648.8825 682.3112 715.9325 718.7798 742.8371 782.4595 796.2635 808.9478 818.5242 841.6149 858.2565 885.6384 908.7719 912.5833 923.6644 935.9790 988.0500 1005.2725 1015.2688 1077.7696 1110.7252 1113.6516 1132.6404 1142.9470 1154.9445 1173.3897 1193.6166 1218.1371 1227.4805 1234.5036 1251.1254 1274.4914 1281.9615 1322.1363 1335.6944 1355.4048 1375.3396 1386.7509 1409.4344 1429.1278 1440.3050 1461.0417 1467.0353 1473.7826 1487.5429 1497.1534 1504.8066 1592.7902 1596.8169 1612.9251 1636.5585 2947.1235 2955.1452 2980.7104 3041.3212 3076.9320 3120.6058 3123.5616 3124.2576 3143.3393 3147.5780 3167.1409 3180.3717 3537.3980 3567.0772
redmass: 6.0495 7.0694 4.2085 4.1629 3.9384 6.4358 5.3488 4.0876 4.1593 2.1972 1.9781 5.1774 2.2633 4.9854 5.1115 2.4204 1.8930 3.3675 4.6782 3.7697 3.2304 3.5372 1.3230 5.0719 3.9348 4.6010 4.4327 5.9457 4.9061 5.6284 4.8092 3.7617 4.7168 1.9811 1.4932 2.6143 2.8799 1.5594 3.8406 1.5316 4.5626 1.3945 4.0832 1.3588 2.1545 5.0578 3.1793 2.0864 1.7932 1.2789 1.6876 1.4137 1.1867 1.4015 2.0043 1.5004 1.3680 1.9370 2.3666 1.8866 1.6780 1.5631 1.3783 4.3020 1.2761 5.9701 4.1343 2.4431 1.4364 1.0995 1.0501 1.0970 2.5470 2.9617 3.3144 5.2098 7.0287 6.6815 7.0082 1.0682 1.0332 1.0836 1.1038 1.0959 1.0896 1.0899 1.0987 1.0916 1.0924 1.0936 1.0949 1.0655 1.0768
irintensity: 0.0085 1.2791 3.8018 4.3474 1.2074 0.6953 0.4108 0.7818 2.3161 0.9603 2.1534 3.1609 4.2685 1.4204 1.0503 66.9566 97.7641 7.0038 17.8896 2.1094 1.1835 6.0530 77.6112 20.2172 12.6290 15.3446 1.7566 2.1581 1.8730 2.2948 2.8406 0.3020 19.2518 13.4124 81.0421 3.2172 1.3977 42.0957 36.0336 10.4633 78.2483 3.7582 4.5294 0.2522 71.1565 73.5271 18.2571 31.4424 6.4056 0.4629 33.7544 10.6535 24.4712 26.1425 11.8742 26.0298 41.7546 180.8954 21.1612 20.3890 5.2662 7.7161 9.0078 68.8239 12.3731 25.8602 7.3793 38.7140 3.6981 8.8083 13.4696 120.2830 327.2230 60.5481 348.3641 8.4259 22.7818 230.7331 8.0953 55.7737 88.9774 42.7880 51.4654 26.6258 22.8962 12.4134 18.3411 3.0256 3.2322 14.5440 1.7310 2.6836 22.7040
temp: 298.150 k
press: 1.00000 atm
elementType: 17 8 8 7 6 6 6 6 6 6 6 6 6 6 6 6 6 6 6 1 1 1 1 1 1 1 1 1 1 1 1 1 1
symmnumber: 1
zpe: 669985.9 jmol-1
zpe.correction: 0.255184 hartree
zpe.thermalcorrener: 0.272117 hartree
zpe.thermalcorrenthalpy: 0.273061 hartree
zpe.thermalcorrgfe: 0.210393 hartree
zpe.sumelectzpe: -1243.891173 hartree
zpe.sumelectthermal: -1243.874241 hartree
zpe.sumelectthermalent: -1243.873297 hartree
zpe.sumelectthermalfe: -1243.935965 hartree
dipole: -4.7039 -2.0106 -0.5872
dipole: 5.1492
quadrupole: -113.8414 -106.0567 -125.1779
quadrupole: 10.7336 -3.8919 -11.9431
quadrupole: 1.1840 8.9686 -10.1526 10.7336 -3.8919 -11.9431
hfenergy: -1244.1463575 hartree
pointgroup: C01 [X(C15H14Cl1N1O2)]
dipole: -1.8878174 -0.7039236 -0.2115356 debye
polarizability: 320.17662|-2.8559331|168.054884|-4.6526275|-26.9569255|104.5126569 unknown
InChI: InChI=1S/C15H14ClNO2/c1-19-10-3-5-14-12(7-10)13(8-18)11-4-2-9(16)6-15(11)17-14/h2-7,13,17-18H,8H2,1H3
charge 0 multiplicity 1
33 atoms
Cl 5.683722 -1.356733 -0.182119
O  0.173098 1.795374 2.123692
O  -4.685714 0.408294 -0.676961
N  0.522727 -1.3399 0.628754
C  0.148368 1.356115 -0.36736
C  -1.015321 0.37705 -0.211968
C  1.498015 0.647351 -0.409597
C  -0.793498 -0.913797 0.358152
C  1.651374 -0.649665 0.162447
C  0.102835 2.407229 0.797793
C  -2.329563 0.758139 -0.543605
C  2.639484 1.288256 -0.934673
C  -1.895588 -1.767934 0.607437
C  2.933342 -1.257736 0.233025
C  -3.429043 -0.099492 -0.300327
C  -3.21126 -1.368399 0.291138
C  3.925049 0.702155 -0.88349
C  4.039012 -0.565872 -0.282379
C  -5.851103 -0.44563 -0.444218
H  0.01454 1.940208 -1.300586
H  -0.820205 3.017667 0.690182
H  0.984243 3.067749 0.743362
H  0.655427 -2.262112 1.04259
H  -2.5269 1.737732 -0.992796
H  2.530374 2.281091 -1.388427
H  -1.725711 -2.760057 1.043568
H  3.058083 -2.251183 0.676009
H  -4.041185 -2.050184 0.496968
H  4.801529 1.213186 -1.288689
H  -0.576728 1.151531 2.210993
H  -5.978217 -0.671736 0.632965
H  -5.779106 -1.392175 -1.015424
H  -6.711781 0.137677 -0.802957
